{"text_format":"1","workbook":"xlsx","n_sheets":4,"sheets":["2022 WiQP","Calc ETA","Data","Revisions"],"not_rendered":{"charts":0,"images":0,"macros":1,"external_links":0,"defined_names":1,"comments":1,"pivot_tables":0},"unopened":[],"bounds":{"document_bytes":16777216,"sheet_cells":100000,"rows_first":2000,"rows_last":500,"rows_between":2000,"halvings":0,"cell_chars":16384,"cell_head_chars":4096},"cells_cut":0,"cells_raw":0,"read":"whole","date_system":"1900"}

{"sheet":"2022 WiQP","index":0,"n_rows":415,"n_cols":50,"rows_kept":415,"cut":false,"hidden":false,"merged":[[85,49,86,49],[1,46,1,49],[5,46,5,49],[2,46,2,51],[11,47,12,47],[7,46,9,49],[11,26,12,26],[1,32,1,36],[9,28,9,30],[1,27,3,30],[4,27,5,30],[25,42,32,44],[11,29,11,35],[3,46,3,49],[414,27,414,28],[11,27,11,28],[15,39,15,44],[414,30,414,34],[14,39,14,44],[11,49,12,49],[11,48,12,48],[11,46,12,46],[11,37,12,37],[11,39,12,44],[85,46,86,46],[85,47,86,47],[85,48,86,48]]}
[]
[null,null,null,null,null,null,null,null,null,null,null,null,null,null,null,null,null,null,null,null,null,null,null,null,null,null,null,"2024 Wisconsin QSO Party\nCounty Tracking Worksheet",null,null,null,null,"Click the SORT button to sort the table in this order",null,null,null,null,null,null,null,null,null,null,null,null,null,">>> Click to visit QSO Party DX Cluster webpage!"]
[]
[null,null,null,null,null,null,null,null,null,null,null,null,null,null,null,null,null,null,null,null,null,null,null,null,null,null,null,null,null,null,null,null,null,"Call sign","Sequence",null,null,null,null,"Sort 1 shows the mobiles listed alphabetically with their intended sequence",null,null,null,null,null,null,">>> Click to visit the WiQP webpage!"]
[null,null,null,null,null,null,null,null,null,null,null,null,null,null,null,null,null,null,null,null,null,null,null,null,null,null,null,{"$f":"MID(CELL(\"filename\"),SEARCH(\"[\",CELL(\"filename\"))+1, SEARCH(\"]\",CELL(\"filename\"))-SEARCH(\"[\",CELL(\"filename\"))-1)","v":"WiQP 2024 Chronology Rev 24.01.xlsm"}]
[null,null,null,null,null,null,null,null,null,null,null,null,null,null,null,null,null,null,null,null,null,null,null,null,null,null,null,null,null,null,null,null,null,"Begin","Duration","County",null,null,null,"Sort 2 shows the time line and how long a mobile will activate the county"]
[]
[null,null,null,null,null,null,null,null,null,null,null,null,null,null,null,null,null,null,null,null,null,null,null,null,null,null,null,"Table color codes =>","Call sign","1 Visit","2 Visits",null,null,"Visits","Begin","Duration",null,null,null,"Sort 3 shows the critical counties with 1 or 2 visits and when to expect them",null,null,null,null,null,null,"Alphabetic listing by County Code"]
[]
[null,null,null,null,null,null,null,null,null,null,null,null,null,null,null,null,null,null,null,null,null,null,null,null,null,null,null,null,"<= Enter a call sign to highlight",null,null,null,null,"County","Begin","Call sign",null,null,null,"Sort 4 shows the counties in alphal order, who will be there and at what time"]
[]
[null,null,null,null,null,null,null,null,null,null,null,null,null,null,null,null,null,null,null,null,null,null,null,null,null,null,null,"Formulas",null,"These columns are manually populated. Gray columns are calculated.",null,null,null,null,null,null,null,null,null,"A 72 County sweep strategy",null,null,null,null,null,null,"County\nVisits","County\nCode","County list","Major\nCity"]
[null,null,null,null,null,null,null,null,null,null,null,null,null,null,null,null,null,null,null,null,null,null,null,null,null,null,null,"County","Visits","Code","Call Sign","Category","Modes","Begin","End","Sequence","Duration"]
[null,null,null,null,null,null,null,null,null,null,null,null,null,null,null,null,null,null,null,null,null,null,null,null,null,{"$f":"IF(AB14=\"\",\"Z\",AB14)","v":"Clark"}," ",{"$f":"IF(ISERROR(VLOOKUP(AD14,$AV$14:$AW$87,2)),\"\",VLOOKUP(AD14,$AV$14:$AW$87,2))","v":"Clark"},{"$f":"IF(AD14=\"\",\"\",COUNTIF(AD:AD,AD14))","v":2},"CLA","K0PC/m","Mobile","CW","13:00:00","13:24:42.353",1,{"$f":"IF(OR(AE14=\"\",AH14=\"\",AI14=\"\"),\"\",IF(AH14=\"part time\",\"\",AI14-AH14))","v":"00:24:42.353"},null,null,null,null,null,null,null,null,null,{"$f":"COUNTIF(AD:AD,AV14)","v":3},"ADA","Adams"]
[null,null,null,null,null,null,null,null,null,null,null,null,null,null,null,null,null,null,null,null,null,null,null,null,null,{"$f":"IF(AB15=\"\",\"Z\",AB15)","v":"Wood"}," ",{"$f":"IF(ISERROR(VLOOKUP(AD15,$AV$14:$AW$87,2)),\"\",VLOOKUP(AD15,$AV$14:$AW$87,2))","v":"Wood"},{"$f":"IF(AD15=\"\",\"\",COUNTIF(AD:AD,AD15))","v":4},"WOO","K0PC/m","Mobile","CW","13:24:42.353","13:49:24.706",2,{"$f":"IF(OR(AE15=\"\",AH15=\"\",AI15=\"\"),\"\",IF(AH15=\"part time\",\"\",AI15-AH15))","v":"00:24:42.353"},null,null,"Become familiar with the four sort options that will help",null,null,null,null,null,null,1,"ASH","Ashland"]
[null,null,null,null,null,null,null,null,null,null,null,null,null,null,null,null,null,null,null,null,null,null,null,null,null,{"$f":"IF(AB16=\"\",\"Z\",AB16)","v":"Portage"}," ",{"$f":"IF(ISERROR(VLOOKUP(AD16,$AV$14:$AW$87,2)),\"\",VLOOKUP(AD16,$AV$14:$AW$87,2))","v":"Portage"},{"$f":"IF(AD16=\"\",\"\",COUNTIF(AD:AD,AD16))","v":5},"POR","K0PC/m","Mobile","CW","13:49:24.706","14:14:07.059",3,{"$f":"IF(OR(AE16=\"\",AH16=\"\",AI16=\"\"),\"\",IF(AH16=\"part time\",\"\",AI16-AH16))","v":"00:24:42.353"},null,null,"you make operating decisions quickly and efficiently.",null,null,null,null,null,null,5,"BAR","Barron"]
[null,null,null,null,null,null,null,null,null,null,null,null,null,null,null,null,null,null,null,null,null,null,null,null,null,{"$f":"IF(AB17=\"\",\"Z\",AB17)","v":"Waupaca"}," ",{"$f":"IF(ISERROR(VLOOKUP(AD17,$AV$14:$AW$87,2)),\"\",VLOOKUP(AD17,$AV$14:$AW$87,2))","v":"Waupaca"},{"$f":"IF(AD17=\"\",\"\",COUNTIF(AD:AD,AD17))","v":4},"WAP","K0PC/m","Mobile","CW","14:14:07.059","14:38:49.412",4,{"$f":"IF(OR(AE17=\"\",AH17=\"\",AI17=\"\"),\"\",IF(AH17=\"part time\",\"\",AI17-AH17))","v":"00:24:42.353"},null,null,null,null,null,null,null,null,null,3,"BAY","Bayfield"]
[null,null,null,null,null,null,null,null,null,null,null,null,null,null,null,null,null,null,null,null,null,null,null,null,null,{"$f":"IF(AB18=\"\",\"Z\",AB18)","v":"Waushara"}," ",{"$f":"IF(ISERROR(VLOOKUP(AD18,$AV$14:$AW$87,2)),\"\",VLOOKUP(AD18,$AV$14:$AW$87,2))","v":"Waushara"},{"$f":"IF(AD18=\"\",\"\",COUNTIF(AD:AD,AD18))","v":4},"WSR","K0PC/m","Mobile","CW","14:38:49.412","15:03:31.765",5,{"$f":"IF(OR(AE18=\"\",AH18=\"\",AI18=\"\"),\"\",IF(AH18=\"part time\",\"\",AI18-AH18))","v":"00:24:42.353"},null,null,"RED","Red highlight rows indicate only one station has committed to ",null,null,null,null,null,2,"BRO","Brown","Green Bay"]
[null,null,null,null,null,null,null,null,null,null,null,null,null,null,null,null,null,null,null,null,null,null,null,null,null,{"$f":"IF(AB19=\"\",\"Z\",AB19)","v":"Winnebago"}," ",{"$f":"IF(ISERROR(VLOOKUP(AD19,$AV$14:$AW$87,2)),\"\",VLOOKUP(AD19,$AV$14:$AW$87,2))","v":"Winnebago"},{"$f":"IF(AD19=\"\",\"\",COUNTIF(AD:AD,AD19))","v":4},"WIN","K0PC/m","Mobile","CW","15:03:31.765","15:28:14.118",6,{"$f":"IF(OR(AE19=\"\",AH19=\"\",AI19=\"\"),\"\",IF(AH19=\"part time\",\"\",AI19-AH19))","v":"00:24:42.353"},null,null,{"$f":"COUNTIF($AC$14:$AC$414,1)&\" Cty's\"","v":"20 Cty's"},"activating this county. If this is a MOBILE operator, making a",null,null,null,null,null,3,"BUF","Buffalo"]
[null,null,null,null,null,null,null,null,null,null,null,null,null,null,null,null,null,null,null,null,null,null,null,null,null,{"$f":"IF(AB20=\"\",\"Z\",AB20)","v":"Fond du Lac"}," ",{"$f":"IF(ISERROR(VLOOKUP(AD20,$AV$14:$AW$87,2)),\"\",VLOOKUP(AD20,$AV$14:$AW$87,2))","v":"Fond du Lac"},{"$f":"IF(AD20=\"\",\"\",COUNTIF(AD:AD,AD20))","v":4},"FON","K0PC/m","Mobile","CW","15:28:14.118","15:52:56.471",7,{"$f":"IF(OR(AE20=\"\",AH20=\"\",AI20=\"\"),\"\",IF(AH20=\"part time\",\"\",AI20-AH20))","v":"00:24:42.353"},null,null,null,"contact with this statoin should be given highest priority.",null,null,null,null,null,4,"BUR","Burnett"]
[null,null,null,null,null,null,null,null,null,null,null,null,null,null,null,null,null,null,null,null,null,null,null,null,null,{"$f":"IF(AB21=\"\",\"Z\",AB21)","v":"Green Lake"}," ",{"$f":"IF(ISERROR(VLOOKUP(AD21,$AV$14:$AW$87,2)),\"\",VLOOKUP(AD21,$AV$14:$AW$87,2))","v":"Green Lake"},{"$f":"IF(AD21=\"\",\"\",COUNTIF(AD:AD,AD21))","v":3},"GRL","K0PC/m","Mobile","CW","15:52:56.471","16:17:38.824",8,{"$f":"IF(OR(AE21=\"\",AH21=\"\",AI21=\"\"),\"\",IF(AH21=\"part time\",\"\",AI21-AH21))","v":"00:24:42.353"},null,null,null,null,null,null,null,null,null,2,"CAL","Calumet"]
[null,null,null,null,null,null,null,null,null,null,null,null,null,null,null,null,null,null,null,null,null,null,null,null,null,{"$f":"IF(AB22=\"\",\"Z\",AB22)","v":"Marquette"}," ",{"$f":"IF(ISERROR(VLOOKUP(AD22,$AV$14:$AW$87,2)),\"\",VLOOKUP(AD22,$AV$14:$AW$87,2))","v":"Marquette"},{"$f":"IF(AD22=\"\",\"\",COUNTIF(AD:AD,AD22))","v":3},"MRQ","K0PC/m","Mobile","CW","16:17:38.824","16:42:21.176",9,{"$f":"IF(OR(AE22=\"\",AH22=\"\",AI22=\"\"),\"\",IF(AH22=\"part time\",\"\",AI22-AH22))","v":"00:24:42.353"},null,null,"Orange","Orange highlight rows indicate two staitons have committed to",null,null,null,null,null,2,"CHI","Chippewa"]
[null,null,null,null,null,null,null,null,null,null,null,null,null,null,null,null,null,null,null,null,null,null,null,null,null,{"$f":"IF(AB23=\"\",\"Z\",AB23)","v":"Adams"}," ",{"$f":"IF(ISERROR(VLOOKUP(AD23,$AV$14:$AW$87,2)),\"\",VLOOKUP(AD23,$AV$14:$AW$87,2))","v":"Adams"},{"$f":"IF(AD23=\"\",\"\",COUNTIF(AD:AD,AD23))","v":3},"ADA","K0PC/m","Mobile","CW","16:42:21.176","17:07:03.529",10,{"$f":"IF(OR(AE23=\"\",AH23=\"\",AI23=\"\"),\"\",IF(AH23=\"part time\",\"\",AI23-AH23))","v":"00:24:42.353"},null,null,{"$f":"COUNTIF($AC$14:$AC$414,2)/2&\" Cty's\"","v":"17 Cty's"},"activating this county. Making a contact with one of these ",null,null,null,null,null,2,"CLA","Clark"]
[null,null,null,null,null,null,null,null,null,null,null,null,null,null,null,null,null,null,null,null,null,null,null,null,null,{"$f":"IF(AB24=\"\",\"Z\",AB24)","v":"Juneau"}," ",{"$f":"IF(ISERROR(VLOOKUP(AD24,$AV$14:$AW$87,2)),\"\",VLOOKUP(AD24,$AV$14:$AW$87,2))","v":"Juneau"},{"$f":"IF(AD24=\"\",\"\",COUNTIF(AD:AD,AD24))","v":1},"JUN","K0PC/m","Mobile","CW","17:07:03.529","17:31:45.882",11,{"$f":"IF(OR(AE24=\"\",AH24=\"\",AI24=\"\"),\"\",IF(AH24=\"part time\",\"\",AI24-AH24))","v":"00:24:42.353"},null,null,null,"stations should also be given higher priority.",null,null,null,null,null,1,"COL","Columbia"]
[null,null,null,null,null,null,null,null,null,null,null,null,null,null,null,null,null,null,null,null,null,null,null,null,null,{"$f":"IF(AB25=\"\",\"Z\",AB25)","v":"Monroe"}," ",{"$f":"IF(ISERROR(VLOOKUP(AD25,$AV$14:$AW$87,2)),\"\",VLOOKUP(AD25,$AV$14:$AW$87,2))","v":"Monroe"},{"$f":"IF(AD25=\"\",\"\",COUNTIF(AD:AD,AD25))","v":1},"MON","K0PC/m","Mobile","CW","17:31:45.882","17:56:28.235",12,{"$f":"IF(OR(AE25=\"\",AH25=\"\",AI25=\"\"),\"\",IF(AH25=\"part time\",\"\",AI25-AH25))","v":"00:24:42.353"},null,null,null,null,null,null,null,null,null,0,"CRA","Crawford"]
[null,null,null,null,null,null,null,null,null,null,null,null,null,null,null,null,null,null,null,null,null,null,null,null,null,{"$f":"IF(AB26=\"\",\"Z\",AB26)","v":"Jackson"}," ",{"$f":"IF(ISERROR(VLOOKUP(AD26,$AV$14:$AW$87,2)),\"\",VLOOKUP(AD26,$AV$14:$AW$87,2))","v":"Jackson"},{"$f":"IF(AD26=\"\",\"\",COUNTIF(AD:AD,AD26))","v":2},"JAC","K0PC/m","Mobile","CW","17:56:28.235","18:21:10.588",13,{"$f":"IF(OR(AE26=\"\",AH26=\"\",AI26=\"\"),\"\",IF(AH26=\"part time\",\"\",AI26-AH26))","v":"00:24:42.353"},null,null,"BRO","Brown","Green Bay","These are high population counties\nwith a major city identified. These\ncounties should be easier to find\nstations to log compared to those\nhighlighted in RED or ORANGE in\nthe large table to the left.",null,null,null,1,"DAN","Dane","Madison"]
[null,null,null,null,null,null,null,null,null,null,null,null,null,null,null,null,null,null,null,null,null,null,null,null,null,{"$f":"IF(AB27=\"\",\"Z\",AB27)","v":"Trempealeau"}," ",{"$f":"IF(ISERROR(VLOOKUP(AD27,$AV$14:$AW$87,2)),\"\",VLOOKUP(AD27,$AV$14:$AW$87,2))","v":"Trempealeau"},{"$f":"IF(AD27=\"\",\"\",COUNTIF(AD:AD,AD27))","v":2},"TRE","K0PC/m","Mobile","CW","18:21:10.588","18:45:52.941",14,{"$f":"IF(OR(AE27=\"\",AH27=\"\",AI27=\"\"),\"\",IF(AH27=\"part time\",\"\",AI27-AH27))","v":"00:24:42.353"},null,null,"DAN","Dane","Madison",null,null,null,null,1,"DOD","Dodge"]
[null,null,null,null,null,null,null,null,null,null,null,null,null,null,null,null,null,null,null,null,null,null,null,null,null,{"$f":"IF(AB28=\"\",\"Z\",AB28)","v":"Eau Claire"}," ",{"$f":"IF(ISERROR(VLOOKUP(AD28,$AV$14:$AW$87,2)),\"\",VLOOKUP(AD28,$AV$14:$AW$87,2))","v":"Eau Claire"},{"$f":"IF(AD28=\"\",\"\",COUNTIF(AD:AD,AD28))","v":5},"EAU","K0PC/m","Mobile","CW","18:45:52.941","19:10:35.294",15,{"$f":"IF(OR(AE28=\"\",AH28=\"\",AI28=\"\"),\"\",IF(AH28=\"part time\",\"\",AI28-AH28))","v":"00:24:42.353"},null,null,"KEN","Kenosah","Kenosha",null,null,null,null,0,"DOO","Door"]
[null,null,null,null,null,null,null,null,null,null,null,null,null,null,null,null,null,null,null,null,null,null,null,null,null,{"$f":"IF(AB29=\"\",\"Z\",AB29)","v":"Dunn"}," ",{"$f":"IF(ISERROR(VLOOKUP(AD29,$AV$14:$AW$87,2)),\"\",VLOOKUP(AD29,$AV$14:$AW$87,2))","v":"Dunn"},{"$f":"IF(AD29=\"\",\"\",COUNTIF(AD:AD,AD29))","v":7},"DUN","K0PC/m","Mobile","CW","19:10:35.294","19:35:17.647",16,{"$f":"IF(OR(AE29=\"\",AH29=\"\",AI29=\"\"),\"\",IF(AH29=\"part time\",\"\",AI29-AH29))","v":"00:24:42.353"},null,null,"MIL","Milwaukee","Milwaukee",null,null,null,null,2,"DOU","Douglas"]
[null,null,null,null,null,null,null,null,null,null,null,null,null,null,null,null,null,null,null,null,null,null,null,null,null,{"$f":"IF(AB30=\"\",\"Z\",AB30)","v":"St Croix"}," ",{"$f":"IF(ISERROR(VLOOKUP(AD30,$AV$14:$AW$87,2)),\"\",VLOOKUP(AD30,$AV$14:$AW$87,2))","v":"St Croix"},{"$f":"IF(AD30=\"\",\"\",COUNTIF(AD:AD,AD30))","v":5},"STC","K0PC/m","Mobile","CW","19:35:17.647","20:00:00",17,{"$f":"IF(OR(AE30=\"\",AH30=\"\",AI30=\"\"),\"\",IF(AH30=\"part time\",\"\",AI30-AH30))","v":"00:24:42.353"},null,null,"OTA","Outagamie","Appleton",null,null,null,null,7,"DUN","Dunn"]
[null,null,null,null,null,null,null,null,null,null,null,null,null,null,null,null,null,null,null,null,null,null,null,null,null,{"$f":"IF(AB31=\"\",\"Z\",AB31)","v":"Polk"}," ",{"$f":"IF(ISERROR(VLOOKUP(AD31,$AV$14:$AW$87,2)),\"\",VLOOKUP(AD31,$AV$14:$AW$87,2))","v":"Polk"},{"$f":"IF(AD31=\"\",\"\",COUNTIF(AD:AD,AD31))","v":5},"POL","K0RC/r","Rover","CW","13:00:00","13:15:00",1,{"$f":"IF(OR(AE31=\"\",AH31=\"\",AI31=\"\"),\"\",IF(AH31=\"part time\",\"\",AI31-AH31))","v":"00:15:00"},null,null,"RAC","Racine","Racine",null,null,null,null,5,"EAU","Eau Claire"]
[null,null,null,null,null,null,null,null,null,null,null,null,null,null,null,null,null,null,null,null,null,null,null,null,null,{"$f":"IF(AB32=\"\",\"Z\",AB32)","v":"Barron"}," ",{"$f":"IF(ISERROR(VLOOKUP(AD32,$AV$14:$AW$87,2)),\"\",VLOOKUP(AD32,$AV$14:$AW$87,2))","v":"Barron"},{"$f":"IF(AD32=\"\",\"\",COUNTIF(AD:AD,AD32))","v":5},"BAR","K0RC/r","Rover","CW","13:15:00","13:30:00",2,{"$f":"IF(OR(AE32=\"\",AH32=\"\",AI32=\"\"),\"\",IF(AH32=\"part time\",\"\",AI32-AH32))","v":"00:15:00"},null,null,"WAU","Waukesha","Waukesah",null,null,null,null,0,"FLO","Florence"]
[null,null,null,null,null,null,null,null,null,null,null,null,null,null,null,null,null,null,null,null,null,null,null,null,null,{"$f":"IF(AB33=\"\",\"Z\",AB33)","v":"Dunn"}," ",{"$f":"IF(ISERROR(VLOOKUP(AD33,$AV$14:$AW$87,2)),\"\",VLOOKUP(AD33,$AV$14:$AW$87,2))","v":"Dunn"},{"$f":"IF(AD33=\"\",\"\",COUNTIF(AD:AD,AD33))","v":7},"DUN","K0RC/r","Rover","CW","13:30:00","13:45:00",3,{"$f":"IF(OR(AE33=\"\",AH33=\"\",AI33=\"\"),\"\",IF(AH33=\"part time\",\"\",AI33-AH33))","v":"00:15:00"},null,null,"WIN","Winnebago","Oshkosh",null,null,null,null,4,"FON","Fond du Lac"]
[null,null,null,null,null,null,null,null,null,null,null,null,null,null,null,null,null,null,null,null,null,null,null,null,null,{"$f":"IF(AB34=\"\",\"Z\",AB34)","v":"St Croix"}," ",{"$f":"IF(ISERROR(VLOOKUP(AD34,$AV$14:$AW$87,2)),\"\",VLOOKUP(AD34,$AV$14:$AW$87,2))","v":"St Croix"},{"$f":"IF(AD34=\"\",\"\",COUNTIF(AD:AD,AD34))","v":5},"STC","K0RC/r","Rover","CW","13:45:00","14:00:00",4,{"$f":"IF(OR(AE34=\"\",AH34=\"\",AI34=\"\"),\"\",IF(AH34=\"part time\",\"\",AI34-AH34))","v":"00:15:00"},null,null,null,null,null,null,null,null,null,0,"FOR","Forest"]
[null,null,null,null,null,null,null,null,null,null,null,null,null,null,null,null,null,null,null,null,null,null,null,null,null,{"$f":"IF(AB35=\"\",\"Z\",AB35)","v":"Rusk"}," ",{"$f":"IF(ISERROR(VLOOKUP(AD35,$AV$14:$AW$87,2)),\"\",VLOOKUP(AD35,$AV$14:$AW$87,2))","v":"Rusk"},{"$f":"IF(AD35=\"\",\"\",COUNTIF(AD:AD,AD35))","v":3},"RUS","K0RC/r","Rover","CW","15:30:00","15:45:00",5,{"$f":"IF(OR(AE35=\"\",AH35=\"\",AI35=\"\"),\"\",IF(AH35=\"part time\",\"\",AI35-AH35))","v":"00:15:00"},null,null,{"$f":"COUNTIF($AF$14:$AF$414,AO35)","v":3},"Fixed","These are the number of counties each type of ",null,null,null,null,0,"GRA","Grant"]
[null,null,null,null,null,null,null,null,null,null,null,null,null,null,null,null,null,null,null,null,null,null,null,null,null,{"$f":"IF(AB36=\"\",\"Z\",AB36)","v":"Taylor"}," ",{"$f":"IF(ISERROR(VLOOKUP(AD36,$AV$14:$AW$87,2)),\"\",VLOOKUP(AD36,$AV$14:$AW$87,2))","v":"Taylor"},{"$f":"IF(AD36=\"\",\"\",COUNTIF(AD:AD,AD36))","v":3},"TAY","K0RC/r","Rover","CW","15:45:00","16:00:00",6,{"$f":"IF(OR(AE36=\"\",AH36=\"\",AI36=\"\"),\"\",IF(AH36=\"part time\",\"\",AI36-AH36))","v":"00:15:00"},null,null,{"$f":"COUNTIF($AF$14:$AF$414,AO36)","v":136},"Mobile","MNQP station will activate on Saturday",null,null,null,null,2,"GRE","Green"]
[null,null,null,null,null,null,null,null,null,null,null,null,null,null,null,null,null,null,null,null,null,null,null,null,null,{"$f":"IF(AB37=\"\",\"Z\",AB37)","v":"Chippewa"}," ",{"$f":"IF(ISERROR(VLOOKUP(AD37,$AV$14:$AW$87,2)),\"\",VLOOKUP(AD37,$AV$14:$AW$87,2))","v":"Chippewa"},{"$f":"IF(AD37=\"\",\"\",COUNTIF(AD:AD,AD37))","v":2},"CHI","K0RC/r","Rover","CW","16:00:00","16:15:00",7,{"$f":"IF(OR(AE37=\"\",AH37=\"\",AI37=\"\"),\"\",IF(AH37=\"part time\",\"\",AI37-AH37))","v":"00:15:00"},null,null,{"$f":"COUNTIF($AF$14:$AF$414,AO37)","v":13},"Rover",null,null,null,null,null,3,"GRL","Green Lake"]
[null,null,null,null,null,null,null,null,null,null,null,null,null,null,null,null,null,null,null,null,null,null,null,null,null,{"$f":"IF(AB38=\"\",\"Z\",AB38)","v":"Washburn"}," ",{"$f":"IF(ISERROR(VLOOKUP(AD38,$AV$14:$AW$87,2)),\"\",VLOOKUP(AD38,$AV$14:$AW$87,2))","v":"Washburn"},{"$f":"IF(AD38=\"\",\"\",COUNTIF(AD:AD,AD38))","v":4},"WSB","K0RC/r","Rover","CW","17:15:00","17:30:00",8,{"$f":"IF(OR(AE38=\"\",AH38=\"\",AI38=\"\"),\"\",IF(AH38=\"part time\",\"\",AI38-AH38))","v":"00:15:00"},null,null,{"$f":"SUM(AN36:AN37)","v":149},"Total","This is the total mobile/rover counties visited.",null,null,null,null,0,"IOW","Iowa"]
[null,null,null,null,null,null,null,null,null,null,null,null,null,null,null,null,null,null,null,null,null,null,null,null,null,{"$f":"IF(AB39=\"\",\"Z\",AB39)","v":"Sawyer"}," ",{"$f":"IF(ISERROR(VLOOKUP(AD39,$AV$14:$AW$87,2)),\"\",VLOOKUP(AD39,$AV$14:$AW$87,2))","v":"Sawyer"},{"$f":"IF(AD39=\"\",\"\",COUNTIF(AD:AD,AD39))","v":4},"SAW","K0RC/r","Rover","CW","17:30:00","17:45:00",9,{"$f":"IF(OR(AE39=\"\",AH39=\"\",AI39=\"\"),\"\",IF(AH39=\"part time\",\"\",AI39-AH39))","v":"00:15:00"},null,null,{"$f":"SUM(AN35:AN37)","v":152},"Total","This is the total of ALL county activations",null,null,null,null,1,"IRO","Iron"]
[null,null,null,null,null,null,null,null,null,null,null,null,null,null,null,null,null,null,null,null,null,null,null,null,null,{"$f":"IF(AB40=\"\",\"Z\",AB40)","v":"Rusk"}," ",{"$f":"IF(ISERROR(VLOOKUP(AD40,$AV$14:$AW$87,2)),\"\",VLOOKUP(AD40,$AV$14:$AW$87,2))","v":"Rusk"},{"$f":"IF(AD40=\"\",\"\",COUNTIF(AD:AD,AD40))","v":3},"RUS","K0RC/r","Rover","CW","17:45:00","18:00:00",10,{"$f":"IF(OR(AE40=\"\",AH40=\"\",AI40=\"\"),\"\",IF(AH40=\"part time\",\"\",AI40-AH40))","v":"00:15:00"},null,null,null,null,null,null,null,null,null,2,"JAC","Jackson"]
[null,null,null,null,null,null,null,null,null,null,null,null,null,null,null,null,null,null,null,null,null,null,null,null,null,{"$f":"IF(AB41=\"\",\"Z\",AB41)","v":"Barron"}," ",{"$f":"IF(ISERROR(VLOOKUP(AD41,$AV$14:$AW$87,2)),\"\",VLOOKUP(AD41,$AV$14:$AW$87,2))","v":"Barron"},{"$f":"IF(AD41=\"\",\"\",COUNTIF(AD:AD,AD41))","v":5},"BAR","K0RC/r","Rover","CW","18:00:00","18:15:00",11,{"$f":"IF(OR(AE41=\"\",AH41=\"\",AI41=\"\"),\"\",IF(AH41=\"part time\",\"\",AI41-AH41))","v":"00:15:00"},null,null,{"$f":"SUMPRODUCT((AE14:AE414<>\"\")/COUNTIF(AE14:AE654,AE14:AE414&\"\"))","v":17.999999999999986},"Call Signs","This is the number of unique call signs and",null,null,null,null,1,"JEF","Jefferson"]
[null,null,null,null,null,null,null,null,null,null,null,null,null,null,null,null,null,null,null,null,null,null,null,null,null,{"$f":"IF(AB42=\"\",\"Z\",AB42)","v":"Burnett"}," ",{"$f":"IF(ISERROR(VLOOKUP(AD42,$AV$14:$AW$87,2)),\"\",VLOOKUP(AD42,$AV$14:$AW$87,2))","v":"Burnett"},{"$f":"IF(AD42=\"\",\"\",COUNTIF(AD:AD,AD42))","v":4},"BUR","K0RC/r","Rover","CW","19:15:00","19:30:00",12,{"$f":"IF(OR(AE42=\"\",AH42=\"\",AI42=\"\"),\"\",IF(AH42=\"part time\",\"\",AI42-AH42))","v":"00:15:00"},null,null,{"$f":"SUMPRODUCT((AD14:AD414<>\"\")/COUNTIF(AD14:AD654,AD14:AD414&\"\"))","v":62.000000000000021},"Counties","counties represented in the table to the left",null,null,null,null,1,"JUN","Juneau"]
[null,null,null,null,null,null,null,null,null,null,null,null,null,null,null,null,null,null,null,null,null,null,null,null,null,{"$f":"IF(AB43=\"\",\"Z\",AB43)","v":"Polk"}," ",{"$f":"IF(ISERROR(VLOOKUP(AD43,$AV$14:$AW$87,2)),\"\",VLOOKUP(AD43,$AV$14:$AW$87,2))","v":"Polk"},{"$f":"IF(AD43=\"\",\"\",COUNTIF(AD:AD,AD43))","v":5},"POL","K0RC/r","Rover","CW","19:30:00","20:00:00",13,{"$f":"IF(OR(AE43=\"\",AH43=\"\",AI43=\"\"),\"\",IF(AH43=\"part time\",\"\",AI43-AH43))","v":"00:30:00"},null,null,null,null,null,null,null,null,null,2,"KEN","Kenosha","Kenosha"]
[null,null,null,null,null,null,null,null,null,null,null,null,null,null,null,null,null,null,null,null,null,null,null,null,null,{"$f":"IF(AB44=\"\",\"Z\",AB44)","v":"Buffalo"}," ",{"$f":"IF(ISERROR(VLOOKUP(AD44,$AV$14:$AW$87,2)),\"\",VLOOKUP(AD44,$AV$14:$AW$87,2))","v":"Buffalo"},{"$f":"IF(AD44=\"\",\"\",COUNTIF(AD:AD,AD44))","v":3},"BUF","K9M/m","Mobile","PH/CW","13:00:00","14:45:00",1,{"$f":"IF(OR(AE44=\"\",AH44=\"\",AI44=\"\"),\"\",IF(AH44=\"part time\",\"\",AI44-AH44))","v":"01:45:00"},null,null,null,null,null,null,null,null,null,1,"KEW","Kewaunee"]
[null,null,null,null,null,null,null,null,null,null,null,null,null,null,null,null,null,null,null,null,null,null,null,null,null,{"$f":"IF(AB45=\"\",\"Z\",AB45)","v":"Pepin"}," ",{"$f":"IF(ISERROR(VLOOKUP(AD45,$AV$14:$AW$87,2)),\"\",VLOOKUP(AD45,$AV$14:$AW$87,2))","v":"Pepin"},{"$f":"IF(AD45=\"\",\"\",COUNTIF(AD:AD,AD45))","v":3},"PEP","K9M/m","Mobile","PH/CW","15:00:00","16:45:00",2,{"$f":"IF(OR(AE45=\"\",AH45=\"\",AI45=\"\"),\"\",IF(AH45=\"part time\",\"\",AI45-AH45))","v":"01:45:00"},null,null,"Counties","Visits","These are the number of counties",null,null,null,null,0,"LAC","La Crosse"]
[null,null,null,null,null,null,null,null,null,null,null,null,null,null,null,null,null,null,null,null,null,null,null,null,null,{"$f":"IF(AB46=\"\",\"Z\",AB46)","v":"Dunn"}," ",{"$f":"IF(ISERROR(VLOOKUP(AD46,$AV$14:$AW$87,2)),\"\",VLOOKUP(AD46,$AV$14:$AW$87,2))","v":"Dunn"},{"$f":"IF(AD46=\"\",\"\",COUNTIF(AD:AD,AD46))","v":7},"DUN","K9M/m","Mobile","PH/CW","17:00:00","18:45:00",3,{"$f":"IF(OR(AE46=\"\",AH46=\"\",AI46=\"\"),\"\",IF(AH46=\"part time\",\"\",AI46-AH46))","v":"01:45:00"},null,null,{"$f":"72-AN65","v":-54},"0 visit","that will have this number of visits",null,null,null,null,0,"LAF","Lafayette"]
[null,null,null,null,null,null,null,null,null,null,null,null,null,null,null,null,null,null,null,null,null,null,null,null,null,{"$f":"IF(AB47=\"\",\"Z\",AB47)","v":"Eau Claire"}," ",{"$f":"IF(ISERROR(VLOOKUP(AD47,$AV$14:$AW$87,2)),\"\",VLOOKUP(AD47,$AV$14:$AW$87,2))","v":"Eau Claire"},{"$f":"IF(AD47=\"\",\"\",COUNTIF(AD:AD,AD47))","v":5},"EAU","K9M/m","Mobile","PH/CW","19:00:00","20:00:00",4,{"$f":"IF(OR(AE47=\"\",AH47=\"\",AI47=\"\"),\"\",IF(AH47=\"part time\",\"\",AI47-AH47))","v":"01:00:00"},null,null,{"$f":"COUNTIF($AC$14:$AC$414,1)","v":20},"1 visit","by mobiles or fixed stations. Less ",null,null,null,null,2,"LAN","Langlade"]
[null,null,null,null,null,null,null,null,null,null,null,null,null,null,null,null,null,null,null,null,null,null,null,null,null,{"$f":"IF(AB48=\"\",\"Z\",AB48)","v":"Winnebago"}," ",{"$f":"IF(ISERROR(VLOOKUP(AD48,$AV$14:$AW$87,2)),\"\",VLOOKUP(AD48,$AV$14:$AW$87,2))","v":"Winnebago"},{"$f":"IF(AD48=\"\",\"\",COUNTIF(AD:AD,AD48))","v":4},"WIN","K9TIT/m","Mobile",null,"13:00:00","13:38:10.909",1,{"$f":"IF(OR(AE48=\"\",AH48=\"\",AI48=\"\"),\"\",IF(AH48=\"part time\",\"\",AI48-AH48))","v":"00:38:10.909"},null,null,{"$f":"COUNTIF($AC$14:$AC$414,2)/2","v":17},"2 visits","visits equates to being more critical to ",null,null,null,null,2,"LIN","Lincoln"]
[null,null,null,null,null,null,null,null,null,null,null,null,null,null,null,null,null,null,null,null,null,null,null,null,null,{"$f":"IF(AB49=\"\",\"Z\",AB49)","v":"Waukesha"}," ",{"$f":"IF(ISERROR(VLOOKUP(AD49,$AV$14:$AW$87,2)),\"\",VLOOKUP(AD49,$AV$14:$AW$87,2))","v":"Waukesha"},{"$f":"IF(AD49=\"\",\"\",COUNTIF(AD:AD,AD49))","v":2},"WAU","K9TIT/m","Mobile",null,"13:38:10.909","14:16:21.818",2,{"$f":"IF(OR(AE49=\"\",AH49=\"\",AI49=\"\"),\"\",IF(AH49=\"part time\",\"\",AI49-AH49))","v":"00:38:10.909"},null,null,{"$f":"COUNTIF($AC$14:$AC$414,3)/3","v":10},"3 visits","make a QSO for an 87 county sweep.",null,null,null,null,0,"MAN","Manitowoc"]
[null,null,null,null,null,null,null,null,null,null,null,null,null,null,null,null,null,null,null,null,null,null,null,null,null,{"$f":"IF(AB50=\"\",\"Z\",AB50)","v":"Waupaca"}," ",{"$f":"IF(ISERROR(VLOOKUP(AD50,$AV$14:$AW$87,2)),\"\",VLOOKUP(AD50,$AV$14:$AW$87,2))","v":"Waupaca"},{"$f":"IF(AD50=\"\",\"\",COUNTIF(AD:AD,AD50))","v":4},"WAP","K9TIT/m","Mobile",null,"14:16:21.818","14:54:32.727",3,{"$f":"IF(OR(AE50=\"\",AH50=\"\",AI50=\"\"),\"\",IF(AH50=\"part time\",\"\",AI50-AH50))","v":"00:38:10.909"},null,null,{"$f":"COUNTIF($AC$14:$AC$414,4)/4","v":8},"4 visits",null,null,null,null,null,3,"MAR","Marathon"]
[null,null,null,null,null,null,null,null,null,null,null,null,null,null,null,null,null,null,null,null,null,null,null,null,null,{"$f":"IF(AB51=\"\",\"Z\",AB51)","v":"Portage"}," ",{"$f":"IF(ISERROR(VLOOKUP(AD51,$AV$14:$AW$87,2)),\"\",VLOOKUP(AD51,$AV$14:$AW$87,2))","v":"Portage"},{"$f":"IF(AD51=\"\",\"\",COUNTIF(AD:AD,AD51))","v":5},"POR","K9TIT/m","Mobile",null,"14:54:32.727","15:32:43.636",4,{"$f":"IF(OR(AE51=\"\",AH51=\"\",AI51=\"\"),\"\",IF(AH51=\"part time\",\"\",AI51-AH51))","v":"00:38:10.909"},null,null,8,"4 visits",null,null,null,null,null,2,"MEN","Menominee"]
[null,null,null,null,null,null,null,null,null,null,null,null,null,null,null,null,null,null,null,null,null,null,null,null,null,{"$f":"IF(AB52=\"\",\"Z\",AB52)","v":"Wood"}," ",{"$f":"IF(ISERROR(VLOOKUP(AD52,$AV$14:$AW$87,2)),\"\",VLOOKUP(AD52,$AV$14:$AW$87,2))","v":"Wood"},{"$f":"IF(AD52=\"\",\"\",COUNTIF(AD:AD,AD52))","v":4},"WOO","K9TIT/m","Mobile",null,"15:32:43.636","16:10:54.545",5,{"$f":"IF(OR(AE52=\"\",AH52=\"\",AI52=\"\"),\"\",IF(AH52=\"part time\",\"\",AI52-AH52))","v":"00:38:10.909"},null,null,8,"4 visits",null,null,null,null,null,1,"MIL","Milwaukee","Milwaukee"]
[null,null,null,null,null,null,null,null,null,null,null,null,null,null,null,null,null,null,null,null,null,null,null,null,null,{"$f":"IF(AB53=\"\",\"Z\",AB53)","v":"Marathon"}," ",{"$f":"IF(ISERROR(VLOOKUP(AD53,$AV$14:$AW$87,2)),\"\",VLOOKUP(AD53,$AV$14:$AW$87,2))","v":"Marathon"},{"$f":"IF(AD53=\"\",\"\",COUNTIF(AD:AD,AD53))","v":3},"MAR","K9TIT/m","Mobile",null,"16:10:54.545","16:49:05.455",6,{"$f":"IF(OR(AE53=\"\",AH53=\"\",AI53=\"\"),\"\",IF(AH53=\"part time\",\"\",AI53-AH53))","v":"00:38:10.909"},null,null,8,"4 visits",null,null,null,null,null,1,"MON","Monroe"]
[null,null,null,null,null,null,null,null,null,null,null,null,null,null,null,null,null,null,null,null,null,null,null,null,null,{"$f":"IF(AB54=\"\",\"Z\",AB54)","v":"Shawano"}," ",{"$f":"IF(ISERROR(VLOOKUP(AD54,$AV$14:$AW$87,2)),\"\",VLOOKUP(AD54,$AV$14:$AW$87,2))","v":"Shawano"},{"$f":"IF(AD54=\"\",\"\",COUNTIF(AD:AD,AD54))","v":5},"SHA","K9TIT/m","Mobile",null,"16:49:05.455","17:27:16.364",7,{"$f":"IF(OR(AE54=\"\",AH54=\"\",AI54=\"\"),\"\",IF(AH54=\"part time\",\"\",AI54-AH54))","v":"00:38:10.909"},null,null,8,"4 visits",null,null,null,null,null,0,"MRN","Marinette"]
[null,null,null,null,null,null,null,null,null,null,null,null,null,null,null,null,null,null,null,null,null,null,null,null,null,{"$f":"IF(AB55=\"\",\"Z\",AB55)","v":"Brown"}," ",{"$f":"IF(ISERROR(VLOOKUP(AD55,$AV$14:$AW$87,2)),\"\",VLOOKUP(AD55,$AV$14:$AW$87,2))","v":"Brown"},{"$f":"IF(AD55=\"\",\"\",COUNTIF(AD:AD,AD55))","v":2},"BRO","K9TIT/m","Mobile",null,"17:27:16.364","18:05:27.273",8,{"$f":"IF(OR(AE55=\"\",AH55=\"\",AI55=\"\"),\"\",IF(AH55=\"part time\",\"\",AI55-AH55))","v":"00:38:10.909"},null,null,8,"4 visits",null,null,null,null,null,3,"MRQ","Marquette"]
[null,null,null,null,null,null,null,null,null,null,null,null,null,null,null,null,null,null,null,null,null,null,null,null,null,{"$f":"IF(AB56=\"\",\"Z\",AB56)","v":"Kewaunee"}," ",{"$f":"IF(ISERROR(VLOOKUP(AD56,$AV$14:$AW$87,2)),\"\",VLOOKUP(AD56,$AV$14:$AW$87,2))","v":"Kewaunee"},{"$f":"IF(AD56=\"\",\"\",COUNTIF(AD:AD,AD56))","v":1},"KEW","K9TIT/m","Mobile",null,"18:05:27.273","18:43:38.182",9,{"$f":"IF(OR(AE56=\"\",AH56=\"\",AI56=\"\"),\"\",IF(AH56=\"part time\",\"\",AI56-AH56))","v":"00:38:10.909"},null,null,8,"4 visits",null,null,null,null,null,1,"OCO","Oconto"]
[null,null,null,null,null,null,null,null,null,null,null,null,null,null,null,null,null,null,null,null,null,null,null,null,null,{"$f":"IF(AB57=\"\",\"Z\",AB57)","v":"Outagamie"}," ",{"$f":"IF(ISERROR(VLOOKUP(AD57,$AV$14:$AW$87,2)),\"\",VLOOKUP(AD57,$AV$14:$AW$87,2))","v":"Outagamie"},{"$f":"IF(AD57=\"\",\"\",COUNTIF(AD:AD,AD57))","v":3},"OUT","K9TIT/m","Mobile",null,"18:43:38.182","19:21:49.091",10,{"$f":"IF(OR(AE57=\"\",AH57=\"\",AI57=\"\"),\"\",IF(AH57=\"part time\",\"\",AI57-AH57))","v":"00:38:10.909"},null,null,8,"4 visits",null,null,null,null,null,1,"ONE","Oneida"]
[null,null,null,null,null,null,null,null,null,null,null,null,null,null,null,null,null,null,null,null,null,null,null,null,null,{"$f":"IF(AB58=\"\",\"Z\",AB58)","v":"Calumet"}," ",{"$f":"IF(ISERROR(VLOOKUP(AD58,$AV$14:$AW$87,2)),\"\",VLOOKUP(AD58,$AV$14:$AW$87,2))","v":"Calumet"},{"$f":"IF(AD58=\"\",\"\",COUNTIF(AD:AD,AD58))","v":2},"CAL","K9TIT/m","Mobile",null,"19:21:49.091","20:00:00",11,{"$f":"IF(OR(AE58=\"\",AH58=\"\",AI58=\"\"),\"\",IF(AH58=\"part time\",\"\",AI58-AH58))","v":"00:38:10.909"},null,null,8,"4 visits",null,null,null,null,null,3,"OUT","Outagamie","Appleton"]
[null,null,null,null,null,null,null,null,null,null,null,null,null,null,null,null,null,null,null,null,null,null,null,null,null,{"$f":"IF(AB59=\"\",\"Z\",AB59)","v":"Eau Claire"}," ",{"$f":"IF(ISERROR(VLOOKUP(AD59,$AV$14:$AW$87,2)),\"\",VLOOKUP(AD59,$AV$14:$AW$87,2))","v":"Eau Claire"},{"$f":"IF(AD59=\"\",\"\",COUNTIF(AD:AD,AD59))","v":5},"EAU","KB9S/m","Mobile","CW","13:00:00","13:26:15",1,{"$f":"IF(OR(AE59=\"\",AH59=\"\",AI59=\"\"),\"\",IF(AH59=\"part time\",\"\",AI59-AH59))","v":"00:26:15"},null,null,{"$f":"COUNTIF($AC$14:$AC$414,5)/5","v":6},"5 visits",null,null,null,null,null,1,"OZA","Ozaukee"]
[null,null,null,null,null,null,null,null,null,null,null,null,null,null,null,null,null,null,null,null,null,null,null,null,null,{"$f":"IF(AB60=\"\",\"Z\",AB60)","v":"Dunn"}," ",{"$f":"IF(ISERROR(VLOOKUP(AD60,$AV$14:$AW$87,2)),\"\",VLOOKUP(AD60,$AV$14:$AW$87,2))","v":"Dunn"},{"$f":"IF(AD60=\"\",\"\",COUNTIF(AD:AD,AD60))","v":7},"DUN","KB9S/m","Mobile","CW","13:26:15","13:52:30",2,{"$f":"IF(OR(AE60=\"\",AH60=\"\",AI60=\"\"),\"\",IF(AH60=\"part time\",\"\",AI60-AH60))","v":"00:26:15"},null,null,{"$f":"COUNTIF($AC$14:$AC$414,6)/6","v":0},"6 visits",null,null,null,null,null,3,"PEP","Pepin"]
[null,null,null,null,null,null,null,null,null,null,null,null,null,null,null,null,null,null,null,null,null,null,null,null,null,{"$f":"IF(AB61=\"\",\"Z\",AB61)","v":"Pepin"}," ",{"$f":"IF(ISERROR(VLOOKUP(AD61,$AV$14:$AW$87,2)),\"\",VLOOKUP(AD61,$AV$14:$AW$87,2))","v":"Pepin"},{"$f":"IF(AD61=\"\",\"\",COUNTIF(AD:AD,AD61))","v":3},"PEP","KB9S/m","Mobile","CW","13:52:30","14:18:45",3,{"$f":"IF(OR(AE61=\"\",AH61=\"\",AI61=\"\"),\"\",IF(AH61=\"part time\",\"\",AI61-AH61))","v":"00:26:15"},null,null,{"$f":"COUNTIF($AC$14:$AC$414,7)/7","v":1},"7 visits",null,null,null,null,null,1,"PIE","Pierce"]
[null,null,null,null,null,null,null,null,null,null,null,null,null,null,null,null,null,null,null,null,null,null,null,null,null,{"$f":"IF(AB62=\"\",\"Z\",AB62)","v":"Buffalo"}," ",{"$f":"IF(ISERROR(VLOOKUP(AD62,$AV$14:$AW$87,2)),\"\",VLOOKUP(AD62,$AV$14:$AW$87,2))","v":"Buffalo"},{"$f":"IF(AD62=\"\",\"\",COUNTIF(AD:AD,AD62))","v":3},"BUF","KB9S/m","Mobile","CW","14:18:45","14:45:00",4,{"$f":"IF(OR(AE62=\"\",AH62=\"\",AI62=\"\"),\"\",IF(AH62=\"part time\",\"\",AI62-AH62))","v":"00:26:15"},null,null,{"$f":"COUNTIF($AC$14:$AC$414,8)/8","v":0},"8 visits",null,null,null,null,null,5,"POL","Polk"]
[null,null,null,null,null,null,null,null,null,null,null,null,null,null,null,null,null,null,null,null,null,null,null,null,null,{"$f":"IF(AB63=\"\",\"Z\",AB63)","v":"Trempealeau"}," ",{"$f":"IF(ISERROR(VLOOKUP(AD63,$AV$14:$AW$87,2)),\"\",VLOOKUP(AD63,$AV$14:$AW$87,2))","v":"Trempealeau"},{"$f":"IF(AD63=\"\",\"\",COUNTIF(AD:AD,AD63))","v":2},"TRE","KB9S/m","Mobile","CW","14:45:00","15:11:15",5,{"$f":"IF(OR(AE63=\"\",AH63=\"\",AI63=\"\"),\"\",IF(AH63=\"part time\",\"\",AI63-AH63))","v":"00:26:15"},null,null,{"$f":"COUNTIF($AC$14:$AC$414,9)/9","v":0},"9 visits",null,null,null,null,null,5,"POR","Portage"]
[null,null,null,null,null,null,null,null,null,null,null,null,null,null,null,null,null,null,null,null,null,null,null,null,null,{"$f":"IF(AB64=\"\",\"Z\",AB64)","v":"Jackson"}," ",{"$f":"IF(ISERROR(VLOOKUP(AD64,$AV$14:$AW$87,2)),\"\",VLOOKUP(AD64,$AV$14:$AW$87,2))","v":"Jackson"},{"$f":"IF(AD64=\"\",\"\",COUNTIF(AD:AD,AD64))","v":2},"JAC","KB9S/m","Mobile","CW","15:11:15","15:37:30",6,{"$f":"IF(OR(AE64=\"\",AH64=\"\",AI64=\"\"),\"\",IF(AH64=\"part time\",\"\",AI64-AH64))","v":"00:26:15"},null,null,{"$f":"COUNTIF($AC$14:$AC$414,10)/10","v":0},"10 visits",null,null,null,null,null,2,"PRI","Price"]
[null,null,null,null,null,null,null,null,null,null,null,null,null,null,null,null,null,null,null,null,null,null,null,null,null,{"$f":"IF(AB65=\"\",\"Z\",AB65)","v":"Clark"}," ",{"$f":"IF(ISERROR(VLOOKUP(AD65,$AV$14:$AW$87,2)),\"\",VLOOKUP(AD65,$AV$14:$AW$87,2))","v":"Clark"},{"$f":"IF(AD65=\"\",\"\",COUNTIF(AD:AD,AD65))","v":2},"CLA","KB9S/m","Mobile","CW","15:37:30","16:03:45",7,{"$f":"IF(OR(AE65=\"\",AH65=\"\",AI65=\"\"),\"\",IF(AH65=\"part time\",\"\",AI65-AH65))","v":"00:26:15"},null,null,{"$f":"SUM(AN47:AN64)","v":126},"TOTAL",null,null,null,null,null,2,"RAC","Racine","Racine"]
[null,null,null,null,null,null,null,null,null,null,null,null,null,null,null,null,null,null,null,null,null,null,null,null,null,{"$f":"IF(AB66=\"\",\"Z\",AB66)","v":"Wood"}," ",{"$f":"IF(ISERROR(VLOOKUP(AD66,$AV$14:$AW$87,2)),\"\",VLOOKUP(AD66,$AV$14:$AW$87,2))","v":"Wood"},{"$f":"IF(AD66=\"\",\"\",COUNTIF(AD:AD,AD66))","v":4},"WOO","KB9S/m","Mobile","CW","16:03:45","16:30:00",8,{"$f":"IF(OR(AE66=\"\",AH66=\"\",AI66=\"\"),\"\",IF(AH66=\"part time\",\"\",AI66-AH66))","v":"00:26:15"},null,null,null,null,null,null,null,null,null,0,"RIC","Richland"]
[null,null,null,null,null,null,null,null,null,null,null,null,null,null,null,null,null,null,null,null,null,null,null,null,null,{"$f":"IF(AB67=\"\",\"Z\",AB67)","v":"Portage"}," ",{"$f":"IF(ISERROR(VLOOKUP(AD67,$AV$14:$AW$87,2)),\"\",VLOOKUP(AD67,$AV$14:$AW$87,2))","v":"Portage"},{"$f":"IF(AD67=\"\",\"\",COUNTIF(AD:AD,AD67))","v":5},"POR","KB9S/m","Mobile","CW","16:30:00","16:56:15",9,{"$f":"IF(OR(AE67=\"\",AH67=\"\",AI67=\"\"),\"\",IF(AH67=\"part time\",\"\",AI67-AH67))","v":"00:26:15"},null,null,null,null,null,null,null,null,null,2,"ROC","Rock"]
[null,null,null,null,null,null,null,null,null,null,null,null,null,null,null,null,null,null,null,null,null,null,null,null,null,{"$f":"IF(AB68=\"\",\"Z\",AB68)","v":"Marathon"}," ",{"$f":"IF(ISERROR(VLOOKUP(AD68,$AV$14:$AW$87,2)),\"\",VLOOKUP(AD68,$AV$14:$AW$87,2))","v":"Marathon"},{"$f":"IF(AD68=\"\",\"\",COUNTIF(AD:AD,AD68))","v":3},"MAR","KB9S/m","Mobile","CW","16:56:15","17:22:30",10,{"$f":"IF(OR(AE68=\"\",AH68=\"\",AI68=\"\"),\"\",IF(AH68=\"part time\",\"\",AI68-AH68))","v":"00:26:15"},null,null,null,null,null,null,null,null,null,3,"RUS","Rusk"]
[null,null,null,null,null,null,null,null,null,null,null,null,null,null,null,null,null,null,null,null,null,null,null,null,null,{"$f":"IF(AB69=\"\",\"Z\",AB69)","v":"Shawano"}," ",{"$f":"IF(ISERROR(VLOOKUP(AD69,$AV$14:$AW$87,2)),\"\",VLOOKUP(AD69,$AV$14:$AW$87,2))","v":"Shawano"},{"$f":"IF(AD69=\"\",\"\",COUNTIF(AD:AD,AD69))","v":5},"SHA","KB9S/m","Mobile","CW","17:22:30","17:48:45",11,{"$f":"IF(OR(AE69=\"\",AH69=\"\",AI69=\"\"),\"\",IF(AH69=\"part time\",\"\",AI69-AH69))","v":"00:26:15"},null,null,null,null,null,null,null,null,null,0,"SAU","Sauk"]
[null,null,null,null,null,null,null,null,null,null,null,null,null,null,null,null,null,null,null,null,null,null,null,null,null,{"$f":"IF(AB70=\"\",\"Z\",AB70)","v":"Menominee"}," ",{"$f":"IF(ISERROR(VLOOKUP(AD70,$AV$14:$AW$87,2)),\"\",VLOOKUP(AD70,$AV$14:$AW$87,2))","v":"Menominee"},{"$f":"IF(AD70=\"\",\"\",COUNTIF(AD:AD,AD70))","v":2},"MEN","KB9S/m","Mobile","CW","17:48:45","18:15:00",12,{"$f":"IF(OR(AE70=\"\",AH70=\"\",AI70=\"\"),\"\",IF(AH70=\"part time\",\"\",AI70-AH70))","v":"00:26:15"},null,null,null,null,null,null,null,null,null,4,"SAW","Sawyer"]
[null,null,null,null,null,null,null,null,null,null,null,null,null,null,null,null,null,null,null,null,null,null,null,null,null,{"$f":"IF(AB71=\"\",\"Z\",AB71)","v":"Langlade"}," ",{"$f":"IF(ISERROR(VLOOKUP(AD71,$AV$14:$AW$87,2)),\"\",VLOOKUP(AD71,$AV$14:$AW$87,2))","v":"Langlade"},{"$f":"IF(AD71=\"\",\"\",COUNTIF(AD:AD,AD71))","v":2},"LAN","KB9S/m","Mobile","CW","18:15:00","18:41:15",13,{"$f":"IF(OR(AE71=\"\",AH71=\"\",AI71=\"\"),\"\",IF(AH71=\"part time\",\"\",AI71-AH71))","v":"00:26:15"},null,null,null,null,null,null,null,null,null,5,"SHA","Shawano"]
[null,null,null,null,null,null,null,null,null,null,null,null,null,null,null,null,null,null,null,null,null,null,null,null,null,{"$f":"IF(AB72=\"\",\"Z\",AB72)","v":"Lincoln"}," ",{"$f":"IF(ISERROR(VLOOKUP(AD72,$AV$14:$AW$87,2)),\"\",VLOOKUP(AD72,$AV$14:$AW$87,2))","v":"Lincoln"},{"$f":"IF(AD72=\"\",\"\",COUNTIF(AD:AD,AD72))","v":2},"LIN","KB9S/m","Mobile","CW","18:41:15","19:07:30",14,{"$f":"IF(OR(AE72=\"\",AH72=\"\",AI72=\"\"),\"\",IF(AH72=\"part time\",\"\",AI72-AH72))","v":"00:26:15"},null,null,null,null,null,null,null,null,null,1,"SHE","Sheboygan"]
[null,null,null,null,null,null,null,null,null,null,null,null,null,null,null,null,null,null,null,null,null,null,null,null,null,{"$f":"IF(AB73=\"\",\"Z\",AB73)","v":"Taylor"}," ",{"$f":"IF(ISERROR(VLOOKUP(AD73,$AV$14:$AW$87,2)),\"\",VLOOKUP(AD73,$AV$14:$AW$87,2))","v":"Taylor"},{"$f":"IF(AD73=\"\",\"\",COUNTIF(AD:AD,AD73))","v":3},"TAY","KB9S/m","Mobile","CW","19:07:30","19:33:45",15,{"$f":"IF(OR(AE73=\"\",AH73=\"\",AI73=\"\"),\"\",IF(AH73=\"part time\",\"\",AI73-AH73))","v":"00:26:15"},null,null,null,null,null,null,null,null,null,5,"STC","St Croix"]
[null,null,null,null,null,null,null,null,null,null,null,null,null,null,null,null,null,null,null,null,null,null,null,null,null,{"$f":"IF(AB74=\"\",\"Z\",AB74)","v":"Chippewa"}," ",{"$f":"IF(ISERROR(VLOOKUP(AD74,$AV$14:$AW$87,2)),\"\",VLOOKUP(AD74,$AV$14:$AW$87,2))","v":"Chippewa"},{"$f":"IF(AD74=\"\",\"\",COUNTIF(AD:AD,AD74))","v":2},"CHI","KB9S/m","Mobile","CW","19:33:45","20:00:00",16,{"$f":"IF(OR(AE74=\"\",AH74=\"\",AI74=\"\"),\"\",IF(AH74=\"part time\",\"\",AI74-AH74))","v":"00:26:15"},null,null,null,null,null,null,null,null,null,3,"TAY","Taylor"]
[null,null,null,null,null,null,null,null,null,null,null,null,null,null,null,null,null,null,null,null,null,null,null,null,null,{"$f":"IF(AB75=\"\",\"Z\",AB75)","v":"St Croix"}," ",{"$f":"IF(ISERROR(VLOOKUP(AD75,$AV$14:$AW$87,2)),\"\",VLOOKUP(AD75,$AV$14:$AW$87,2))","v":"St Croix"},{"$f":"IF(AD75=\"\",\"\",COUNTIF(AD:AD,AD75))","v":5},"STC","KE0TL/m","Mobile","PH/CW","13:00:00","13:40:00",1,{"$f":"IF(OR(AE75=\"\",AH75=\"\",AI75=\"\"),\"\",IF(AH75=\"part time\",\"\",AI75-AH75))","v":"00:40:00"},null,null,null,null,null,null,null,null,null,2,"TRE","Trempealeau"]
[null,null,null,null,null,null,null,null,null,null,null,null,null,null,null,null,null,null,null,null,null,null,null,null,null,{"$f":"IF(AB76=\"\",\"Z\",AB76)","v":"Polk"}," ",{"$f":"IF(ISERROR(VLOOKUP(AD76,$AV$14:$AW$87,2)),\"\",VLOOKUP(AD76,$AV$14:$AW$87,2))","v":"Polk"},{"$f":"IF(AD76=\"\",\"\",COUNTIF(AD:AD,AD76))","v":5},"POL","KE0TL/m","Mobile","PH/CW","13:40:00","14:35:00",2,{"$f":"IF(OR(AE76=\"\",AH76=\"\",AI76=\"\"),\"\",IF(AH76=\"part time\",\"\",AI76-AH76))","v":"00:55:00"},null,null,null,null,null,null,null,null,null,1,"VER","Vernon"]
[null,null,null,null,null,null,null,null,null,null,null,null,null,null,null,null,null,null,null,null,null,null,null,null,null,{"$f":"IF(AB77=\"\",\"Z\",AB77)","v":"Burnett"}," ",{"$f":"IF(ISERROR(VLOOKUP(AD77,$AV$14:$AW$87,2)),\"\",VLOOKUP(AD77,$AV$14:$AW$87,2))","v":"Burnett"},{"$f":"IF(AD77=\"\",\"\",COUNTIF(AD:AD,AD77))","v":4},"BUR","KE0TL/m","Mobile","PH/CW","14:35:00","15:30:00",3,{"$f":"IF(OR(AE77=\"\",AH77=\"\",AI77=\"\"),\"\",IF(AH77=\"part time\",\"\",AI77-AH77))","v":"00:55:00"},null,null,null,null,null,null,null,null,null,1,"VIL","Vilas"]
[null,null,null,null,null,null,null,null,null,null,null,null,null,null,null,null,null,null,null,null,null,null,null,null,null,{"$f":"IF(AB78=\"\",\"Z\",AB78)","v":"Douglas"}," ",{"$f":"IF(ISERROR(VLOOKUP(AD78,$AV$14:$AW$87,2)),\"\",VLOOKUP(AD78,$AV$14:$AW$87,2))","v":"Douglas"},{"$f":"IF(AD78=\"\",\"\",COUNTIF(AD:AD,AD78))","v":2},"DOU","KE0TL/m","Mobile","PH/CW","15:30:00","16:30:00",4,{"$f":"IF(OR(AE78=\"\",AH78=\"\",AI78=\"\"),\"\",IF(AH78=\"part time\",\"\",AI78-AH78))","v":"01:00:00"},null,null,null,null,null,null,null,null,null,{"$f":"COUNTIF(AD:AD,AV78)","v":2},"WAL","Walworth"]
[null,null,null,null,null,null,null,null,null,null,null,null,null,null,null,null,null,null,null,null,null,null,null,null,null,{"$f":"IF(AB79=\"\",\"Z\",AB79)","v":"Bayfield"}," ",{"$f":"IF(ISERROR(VLOOKUP(AD79,$AV$14:$AW$87,2)),\"\",VLOOKUP(AD79,$AV$14:$AW$87,2))","v":"Bayfield"},{"$f":"IF(AD79=\"\",\"\",COUNTIF(AD:AD,AD79))","v":3},"BAY","KE0TL/m","Mobile","PH/CW","16:30:00","17:10:00",5,{"$f":"IF(OR(AE79=\"\",AH79=\"\",AI79=\"\"),\"\",IF(AH79=\"part time\",\"\",AI79-AH79))","v":"00:40:00"},null,null,null,null,null,null,null,null,null,4,"WAP","Waupaca"]
[null,null,null,null,null,null,null,null,null,null,null,null,null,null,null,null,null,null,null,null,null,null,null,null,null,{"$f":"IF(AB80=\"\",\"Z\",AB80)","v":"Sawyer"}," ",{"$f":"IF(ISERROR(VLOOKUP(AD80,$AV$14:$AW$87,2)),\"\",VLOOKUP(AD80,$AV$14:$AW$87,2))","v":"Sawyer"},{"$f":"IF(AD80=\"\",\"\",COUNTIF(AD:AD,AD80))","v":4},"SAW","KE0TL/m","Mobile","PH/CW","17:10:00","18:00:00",6,{"$f":"IF(OR(AE80=\"\",AH80=\"\",AI80=\"\"),\"\",IF(AH80=\"part time\",\"\",AI80-AH80))","v":"00:50:00"},null,null,null,null,null,null,null,null,null,1,"WAS","Washington"]
[null,null,null,null,null,null,null,null,null,null,null,null,null,null,null,null,null,null,null,null,null,null,null,null,null,{"$f":"IF(AB81=\"\",\"Z\",AB81)","v":"Washburn"}," ",{"$f":"IF(ISERROR(VLOOKUP(AD81,$AV$14:$AW$87,2)),\"\",VLOOKUP(AD81,$AV$14:$AW$87,2))","v":"Washburn"},{"$f":"IF(AD81=\"\",\"\",COUNTIF(AD:AD,AD81))","v":4},"WSB","KE0TL/m","Mobile","PH/CW","18:00:00","19:00:00",7,{"$f":"IF(OR(AE81=\"\",AH81=\"\",AI81=\"\"),\"\",IF(AH81=\"part time\",\"\",AI81-AH81))","v":"01:00:00"},null,null,null,null,null,null,null,null,null,2,"WAU","Waukesha","Waukesha"]
[null,null,null,null,null,null,null,null,null,null,null,null,null,null,null,null,null,null,null,null,null,null,null,null,null,{"$f":"IF(AB82=\"\",\"Z\",AB82)","v":"Barron"}," ",{"$f":"IF(ISERROR(VLOOKUP(AD82,$AV$14:$AW$87,2)),\"\",VLOOKUP(AD82,$AV$14:$AW$87,2))","v":"Barron"},{"$f":"IF(AD82=\"\",\"\",COUNTIF(AD:AD,AD82))","v":5},"BAR","KE0TL/m","Mobile","PH/CW","19:00:00","20:00:00",8,{"$f":"IF(OR(AE82=\"\",AH82=\"\",AI82=\"\"),\"\",IF(AH82=\"part time\",\"\",AI82-AH82))","v":"01:00:00"},null,null,null,null,null,null,null,null,null,4,"WIN","Winnebago","Oshkosh"]
[null,null,null,null,null,null,null,null,null,null,null,null,null,null,null,null,null,null,null,null,null,null,null,null,null,{"$f":"IF(AB83=\"\",\"Z\",AB83)","v":"Waupaca"}," ",{"$f":"IF(ISERROR(VLOOKUP(AD83,$AV$14:$AW$87,2)),\"\",VLOOKUP(AD83,$AV$14:$AW$87,2))","v":"Waupaca"},{"$f":"IF(AD83=\"\",\"\",COUNTIF(AD:AD,AD83))","v":4},"WAP","KX9RT/m","Mobile","CW","13:00:00","13:26:15",1,{"$f":"IF(OR(AE83=\"\",AH83=\"\",AI83=\"\"),\"\",IF(AH83=\"part time\",\"\",AI83-AH83))","v":"00:26:15"},null,null,null,null,null,null,null,null,null,4,"WOO","Wood"]
[null,null,null,null,null,null,null,null,null,null,null,null,null,null,null,null,null,null,null,null,null,null,null,null,null,{"$f":"IF(AB84=\"\",\"Z\",AB84)","v":"Portage"}," ",{"$f":"IF(ISERROR(VLOOKUP(AD84,$AV$14:$AW$87,2)),\"\",VLOOKUP(AD84,$AV$14:$AW$87,2))","v":"Portage"},{"$f":"IF(AD84=\"\",\"\",COUNTIF(AD:AD,AD84))","v":5},"POR","KX9RT/m","Mobile","CW","13:26:15","13:52:30",2,{"$f":"IF(OR(AE84=\"\",AH84=\"\",AI84=\"\"),\"\",IF(AH84=\"part time\",\"\",AI84-AH84))","v":"00:26:15"},null,null,null,null,null,null,null,null,null,4,"WSB","Washburn"]
[null,null,null,null,null,null,null,null,null,null,null,null,null,null,null,null,null,null,null,null,null,null,null,null,null,{"$f":"IF(AB85=\"\",\"Z\",AB85)","v":"Marathon"}," ",{"$f":"IF(ISERROR(VLOOKUP(AD85,$AV$14:$AW$87,2)),\"\",VLOOKUP(AD85,$AV$14:$AW$87,2))","v":"Marathon"},{"$f":"IF(AD85=\"\",\"\",COUNTIF(AD:AD,AD85))","v":3},"MAR","KX9RT/m","Mobile","CW","13:52:30","14:18:45",3,{"$f":"IF(OR(AE85=\"\",AH85=\"\",AI85=\"\"),\"\",IF(AH85=\"part time\",\"\",AI85-AH85))","v":"00:26:15"},null,null,null,null,null,null,null,null,null,4,"WSR","Waushara"]
[null,null,null,null,null,null,null,null,null,null,null,null,null,null,null,null,null,null,null,null,null,null,null,null,null,{"$f":"IF(AB86=\"\",\"Z\",AB86)","v":"Shawano"}," ",{"$f":"IF(ISERROR(VLOOKUP(AD86,$AV$14:$AW$87,2)),\"\",VLOOKUP(AD86,$AV$14:$AW$87,2))","v":"Shawano"},{"$f":"IF(AD86=\"\",\"\",COUNTIF(AD:AD,AD86))","v":5},"SHA","KX9RT/m","Mobile","CW","14:18:45","14:45:00",4,{"$f":"IF(OR(AE86=\"\",AH86=\"\",AI86=\"\"),\"\",IF(AH86=\"part time\",\"\",AI86-AH86))","v":"00:26:15"},null,null,null,null,null,null,null,null,null,{"$f":"SUM(AU14:AU85)","v":151},{"$f":"COUNTIF(AV14:AV85,\">\"\"\")","v":72},"Totals","Max = 72"]
[null,null,null,null,null,null,null,null,null,null,null,null,null,null,null,null,null,null,null,null,null,null,null,null,null,{"$f":"IF(AB87=\"\",\"Z\",AB87)","v":"Menominee"}," ",{"$f":"IF(ISERROR(VLOOKUP(AD87,$AV$14:$AW$87,2)),\"\",VLOOKUP(AD87,$AV$14:$AW$87,2))","v":"Menominee"},{"$f":"IF(AD87=\"\",\"\",COUNTIF(AD:AD,AD87))","v":2},"MEN","KX9RT/m","Mobile","CW","14:45:00","15:11:15",5,{"$f":"IF(OR(AE87=\"\",AH87=\"\",AI87=\"\"),\"\",IF(AH87=\"part time\",\"\",AI87-AH87))","v":"00:26:15"}]
[null,null,null,null,null,null,null,null,null,null,null,null,null,null,null,null,null,null,null,null,null,null,null,null,null,{"$f":"IF(AB88=\"\",\"Z\",AB88)","v":"Oconto"}," ",{"$f":"IF(ISERROR(VLOOKUP(AD88,$AV$14:$AW$87,2)),\"\",VLOOKUP(AD88,$AV$14:$AW$87,2))","v":"Oconto"},{"$f":"IF(AD88=\"\",\"\",COUNTIF(AD:AD,AD88))","v":1},"OCO","KX9RT/m","Mobile","CW","15:11:15","15:37:30",6,{"$f":"IF(OR(AE88=\"\",AH88=\"\",AI88=\"\"),\"\",IF(AH88=\"part time\",\"\",AI88-AH88))","v":"00:26:15"}]
[null,null,null,null,null,null,null,null,null,null,null,null,null,null,null,null,null,null,null,null,null,null,null,null,null,{"$f":"IF(AB89=\"\",\"Z\",AB89)","v":"Brown"}," ",{"$f":"IF(ISERROR(VLOOKUP(AD89,$AV$14:$AW$87,2)),\"\",VLOOKUP(AD89,$AV$14:$AW$87,2))","v":"Brown"},{"$f":"IF(AD89=\"\",\"\",COUNTIF(AD:AD,AD89))","v":2},"BRO","KX9RT/m","Mobile","CW","15:37:30","16:03:45",7,{"$f":"IF(OR(AE89=\"\",AH89=\"\",AI89=\"\"),\"\",IF(AH89=\"part time\",\"\",AI89-AH89))","v":"00:26:15"},null,null,null,null,null,null,null,null,null,null,{"$f":"COUNTIF(AU14:AU85,\"=0\")","v":12},"Not activated !!!"]
[null,null,null,null,null,null,null,null,null,null,null,null,null,null,null,null,null,null,null,null,null,null,null,null,null,{"$f":"IF(AB90=\"\",\"Z\",AB90)","v":"Outagamie"}," ",{"$f":"IF(ISERROR(VLOOKUP(AD90,$AV$14:$AW$87,2)),\"\",VLOOKUP(AD90,$AV$14:$AW$87,2))","v":"Outagamie"},{"$f":"IF(AD90=\"\",\"\",COUNTIF(AD:AD,AD90))","v":3},"OUT","KX9RT/m","Mobile","CW","16:03:45","16:30:00",8,{"$f":"IF(OR(AE90=\"\",AH90=\"\",AI90=\"\"),\"\",IF(AH90=\"part time\",\"\",AI90-AH90))","v":"00:26:15"}]
[null,null,null,null,null,null,null,null,null,null,null,null,null,null,null,null,null,null,null,null,null,null,null,null,null,{"$f":"IF(AB91=\"\",\"Z\",AB91)","v":"Calumet"}," ",{"$f":"IF(ISERROR(VLOOKUP(AD91,$AV$14:$AW$87,2)),\"\",VLOOKUP(AD91,$AV$14:$AW$87,2))","v":"Calumet"},{"$f":"IF(AD91=\"\",\"\",COUNTIF(AD:AD,AD91))","v":2},"CAL","KX9RT/m","Mobile","CW","16:30:00","16:56:15",9,{"$f":"IF(OR(AE91=\"\",AH91=\"\",AI91=\"\"),\"\",IF(AH91=\"part time\",\"\",AI91-AH91))","v":"00:26:15"}]
[null,null,null,null,null,null,null,null,null,null,null,null,null,null,null,null,null,null,null,null,null,null,null,null,null,{"$f":"IF(AB92=\"\",\"Z\",AB92)","v":"Winnebago"}," ",{"$f":"IF(ISERROR(VLOOKUP(AD92,$AV$14:$AW$87,2)),\"\",VLOOKUP(AD92,$AV$14:$AW$87,2))","v":"Winnebago"},{"$f":"IF(AD92=\"\",\"\",COUNTIF(AD:AD,AD92))","v":4},"WIN","KX9RT/m","Mobile","CW","16:56:15","17:22:30",10,{"$f":"IF(OR(AE92=\"\",AH92=\"\",AI92=\"\"),\"\",IF(AH92=\"part time\",\"\",AI92-AH92))","v":"00:26:15"}]
[null,null,null,null,null,null,null,null,null,null,null,null,null,null,null,null,null,null,null,null,null,null,null,null,null,{"$f":"IF(AB93=\"\",\"Z\",AB93)","v":"Fond du Lac"}," ",{"$f":"IF(ISERROR(VLOOKUP(AD93,$AV$14:$AW$87,2)),\"\",VLOOKUP(AD93,$AV$14:$AW$87,2))","v":"Fond du Lac"},{"$f":"IF(AD93=\"\",\"\",COUNTIF(AD:AD,AD93))","v":4},"FON","KX9RT/m","Mobile","CW","17:22:30","17:48:45",11,{"$f":"IF(OR(AE93=\"\",AH93=\"\",AI93=\"\"),\"\",IF(AH93=\"part time\",\"\",AI93-AH93))","v":"00:26:15"}]
[null,null,null,null,null,null,null,null,null,null,null,null,null,null,null,null,null,null,null,null,null,null,null,null,null,{"$f":"IF(AB94=\"\",\"Z\",AB94)","v":"Green Lake"}," ",{"$f":"IF(ISERROR(VLOOKUP(AD94,$AV$14:$AW$87,2)),\"\",VLOOKUP(AD94,$AV$14:$AW$87,2))","v":"Green Lake"},{"$f":"IF(AD94=\"\",\"\",COUNTIF(AD:AD,AD94))","v":3},"GRL","KX9RT/m","Mobile","CW","17:48:45","18:15:00",12,{"$f":"IF(OR(AE94=\"\",AH94=\"\",AI94=\"\"),\"\",IF(AH94=\"part time\",\"\",AI94-AH94))","v":"00:26:15"}]
[null,null,null,null,null,null,null,null,null,null,null,null,null,null,null,null,null,null,null,null,null,null,null,null,null,{"$f":"IF(AB95=\"\",\"Z\",AB95)","v":"Marquette"}," ",{"$f":"IF(ISERROR(VLOOKUP(AD95,$AV$14:$AW$87,2)),\"\",VLOOKUP(AD95,$AV$14:$AW$87,2))","v":"Marquette"},{"$f":"IF(AD95=\"\",\"\",COUNTIF(AD:AD,AD95))","v":3},"MRQ","KX9RT/m","Mobile","CW","18:15:00","18:41:15",13,{"$f":"IF(OR(AE95=\"\",AH95=\"\",AI95=\"\"),\"\",IF(AH95=\"part time\",\"\",AI95-AH95))","v":"00:26:15"}]
[null,null,null,null,null,null,null,null,null,null,null,null,null,null,null,null,null,null,null,null,null,null,null,null,null,{"$f":"IF(AB96=\"\",\"Z\",AB96)","v":"Waushara"}," ",{"$f":"IF(ISERROR(VLOOKUP(AD96,$AV$14:$AW$87,2)),\"\",VLOOKUP(AD96,$AV$14:$AW$87,2))","v":"Waushara"},{"$f":"IF(AD96=\"\",\"\",COUNTIF(AD:AD,AD96))","v":4},"WSR","KX9RT/m","Mobile","CW","18:41:15","19:07:30",14,{"$f":"IF(OR(AE96=\"\",AH96=\"\",AI96=\"\"),\"\",IF(AH96=\"part time\",\"\",AI96-AH96))","v":"00:26:15"}]
[null,null,null,null,null,null,null,null,null,null,null,null,null,null,null,null,null,null,null,null,null,null,null,null,null,{"$f":"IF(AB97=\"\",\"Z\",AB97)","v":"Adams"}," ",{"$f":"IF(ISERROR(VLOOKUP(AD97,$AV$14:$AW$87,2)),\"\",VLOOKUP(AD97,$AV$14:$AW$87,2))","v":"Adams"},{"$f":"IF(AD97=\"\",\"\",COUNTIF(AD:AD,AD97))","v":3},"ADA","KX9RT/m","Mobile","CW","19:07:30","19:33:45",15,{"$f":"IF(OR(AE97=\"\",AH97=\"\",AI97=\"\"),\"\",IF(AH97=\"part time\",\"\",AI97-AH97))","v":"00:26:15"}]
[null,null,null,null,null,null,null,null,null,null,null,null,null,null,null,null,null,null,null,null,null,null,null,null,null,{"$f":"IF(AB98=\"\",\"Z\",AB98)","v":"Wood"}," ",{"$f":"IF(ISERROR(VLOOKUP(AD98,$AV$14:$AW$87,2)),\"\",VLOOKUP(AD98,$AV$14:$AW$87,2))","v":"Wood"},{"$f":"IF(AD98=\"\",\"\",COUNTIF(AD:AD,AD98))","v":4},"WOO","KX9RT/m","Mobile","CW","19:33:45","20:00:00",16,{"$f":"IF(OR(AE98=\"\",AH98=\"\",AI98=\"\"),\"\",IF(AH98=\"part time\",\"\",AI98-AH98))","v":"00:26:15"}]
[null,null,null,null,null,null,null,null,null,null,null,null,null,null,null,null,null,null,null,null,null,null,null,null,null,{"$f":"IF(AB99=\"\",\"Z\",AB99)","v":"Buffalo"}," ",{"$f":"IF(ISERROR(VLOOKUP(AD99,$AV$14:$AW$87,2)),\"\",VLOOKUP(AD99,$AV$14:$AW$87,2))","v":"Buffalo"},{"$f":"IF(AD99=\"\",\"\",COUNTIF(AD:AD,AD99))","v":3},"BUF","KZ8V/m","Mobile","CW/PH","13:00:00","14:45:00",1,{"$f":"IF(OR(AE99=\"\",AH99=\"\",AI99=\"\"),\"\",IF(AH99=\"part time\",\"\",AI99-AH99))","v":"01:45:00"}]
[null,null,null,null,null,null,null,null,null,null,null,null,null,null,null,null,null,null,null,null,null,null,null,null,null,{"$f":"IF(AB100=\"\",\"Z\",AB100)","v":"Pepin"}," ",{"$f":"IF(ISERROR(VLOOKUP(AD100,$AV$14:$AW$87,2)),\"\",VLOOKUP(AD100,$AV$14:$AW$87,2))","v":"Pepin"},{"$f":"IF(AD100=\"\",\"\",COUNTIF(AD:AD,AD100))","v":3},"PEP","KZ8V/m","Mobile","CW/PH","14:45:00","16:30:00",2,{"$f":"IF(OR(AE100=\"\",AH100=\"\",AI100=\"\"),\"\",IF(AH100=\"part time\",\"\",AI100-AH100))","v":"01:45:00"}]
[null,null,null,null,null,null,null,null,null,null,null,null,null,null,null,null,null,null,null,null,null,null,null,null,null,{"$f":"IF(AB101=\"\",\"Z\",AB101)","v":"Dunn"}," ",{"$f":"IF(ISERROR(VLOOKUP(AD101,$AV$14:$AW$87,2)),\"\",VLOOKUP(AD101,$AV$14:$AW$87,2))","v":"Dunn"},{"$f":"IF(AD101=\"\",\"\",COUNTIF(AD:AD,AD101))","v":7},"DUN","KZ8V/m","Mobile","CW/PH","16:30:00","18:15:00",3,{"$f":"IF(OR(AE101=\"\",AH101=\"\",AI101=\"\"),\"\",IF(AH101=\"part time\",\"\",AI101-AH101))","v":"01:45:00"}]
[null,null,null,null,null,null,null,null,null,null,null,null,null,null,null,null,null,null,null,null,null,null,null,null,null,{"$f":"IF(AB102=\"\",\"Z\",AB102)","v":"Eau Claire"}," ",{"$f":"IF(ISERROR(VLOOKUP(AD102,$AV$14:$AW$87,2)),\"\",VLOOKUP(AD102,$AV$14:$AW$87,2))","v":"Eau Claire"},{"$f":"IF(AD102=\"\",\"\",COUNTIF(AD:AD,AD102))","v":5},"EAU","KZ8V/m","Mobile","CW/PH","18:15:00","20:00:00",4,{"$f":"IF(OR(AE102=\"\",AH102=\"\",AI102=\"\"),\"\",IF(AH102=\"part time\",\"\",AI102-AH102))","v":"01:45:00"}]
[null,null,null,null,null,null,null,null,null,null,null,null,null,null,null,null,null,null,null,null,null,null,null,null,null,{"$f":"IF(AB103=\"\",\"Z\",AB103)","v":"St Croix"}," ",{"$f":"IF(ISERROR(VLOOKUP(AD103,$AV$14:$AW$87,2)),\"\",VLOOKUP(AD103,$AV$14:$AW$87,2))","v":"St Croix"},{"$f":"IF(AD103=\"\",\"\",COUNTIF(AD:AD,AD103))","v":5},"STC","NR0T/m","Mobile","CW/PH","13:00:00","13:46:40",1,{"$f":"IF(OR(AE103=\"\",AH103=\"\",AI103=\"\"),\"\",IF(AH103=\"part time\",\"\",AI103-AH103))","v":"00:46:40"}]
[null,null,null,null,null,null,null,null,null,null,null,null,null,null,null,null,null,null,null,null,null,null,null,null,null,{"$f":"IF(AB104=\"\",\"Z\",AB104)","v":"Dunn"}," ",{"$f":"IF(ISERROR(VLOOKUP(AD104,$AV$14:$AW$87,2)),\"\",VLOOKUP(AD104,$AV$14:$AW$87,2))","v":"Dunn"},{"$f":"IF(AD104=\"\",\"\",COUNTIF(AD:AD,AD104))","v":7},"DUN","NR0T/m","Mobile","CW/PH","13:46:40","14:33:20",2,{"$f":"IF(OR(AE104=\"\",AH104=\"\",AI104=\"\"),\"\",IF(AH104=\"part time\",\"\",AI104-AH104))","v":"00:46:40"}]
[null,null,null,null,null,null,null,null,null,null,null,null,null,null,null,null,null,null,null,null,null,null,null,null,null,{"$f":"IF(AB105=\"\",\"Z\",AB105)","v":"Barron"}," ",{"$f":"IF(ISERROR(VLOOKUP(AD105,$AV$14:$AW$87,2)),\"\",VLOOKUP(AD105,$AV$14:$AW$87,2))","v":"Barron"},{"$f":"IF(AD105=\"\",\"\",COUNTIF(AD:AD,AD105))","v":5},"BAR","NR0T/m","Mobile","CW/PH","14:33:20","15:20:00",3,{"$f":"IF(OR(AE105=\"\",AH105=\"\",AI105=\"\"),\"\",IF(AH105=\"part time\",\"\",AI105-AH105))","v":"00:46:40"}]
[null,null,null,null,null,null,null,null,null,null,null,null,null,null,null,null,null,null,null,null,null,null,null,null,null,{"$f":"IF(AB106=\"\",\"Z\",AB106)","v":"Washburn"}," ",{"$f":"IF(ISERROR(VLOOKUP(AD106,$AV$14:$AW$87,2)),\"\",VLOOKUP(AD106,$AV$14:$AW$87,2))","v":"Washburn"},{"$f":"IF(AD106=\"\",\"\",COUNTIF(AD:AD,AD106))","v":4},"WSB","NR0T/m","Mobile","CW/PH","15:20:00","16:06:40",4,{"$f":"IF(OR(AE106=\"\",AH106=\"\",AI106=\"\"),\"\",IF(AH106=\"part time\",\"\",AI106-AH106))","v":"00:46:40"}]
[null,null,null,null,null,null,null,null,null,null,null,null,null,null,null,null,null,null,null,null,null,null,null,null,null,{"$f":"IF(AB107=\"\",\"Z\",AB107)","v":"Sawyer"}," ",{"$f":"IF(ISERROR(VLOOKUP(AD107,$AV$14:$AW$87,2)),\"\",VLOOKUP(AD107,$AV$14:$AW$87,2))","v":"Sawyer"},{"$f":"IF(AD107=\"\",\"\",COUNTIF(AD:AD,AD107))","v":4},"SAW","NR0T/m","Mobile","CW/PH","16:06:40","16:53:20",5,{"$f":"IF(OR(AE107=\"\",AH107=\"\",AI107=\"\"),\"\",IF(AH107=\"part time\",\"\",AI107-AH107))","v":"00:46:40"}]
[null,null,null,null,null,null,null,null,null,null,null,null,null,null,null,null,null,null,null,null,null,null,null,null,null,{"$f":"IF(AB108=\"\",\"Z\",AB108)","v":"Bayfield"}," ",{"$f":"IF(ISERROR(VLOOKUP(AD108,$AV$14:$AW$87,2)),\"\",VLOOKUP(AD108,$AV$14:$AW$87,2))","v":"Bayfield"},{"$f":"IF(AD108=\"\",\"\",COUNTIF(AD:AD,AD108))","v":3},"BAY","NR0T/m","Mobile","CW/PH","16:53:20","17:40:00",6,{"$f":"IF(OR(AE108=\"\",AH108=\"\",AI108=\"\"),\"\",IF(AH108=\"part time\",\"\",AI108-AH108))","v":"00:46:40"}]
[null,null,null,null,null,null,null,null,null,null,null,null,null,null,null,null,null,null,null,null,null,null,null,null,null,{"$f":"IF(AB109=\"\",\"Z\",AB109)","v":"Douglas"}," ",{"$f":"IF(ISERROR(VLOOKUP(AD109,$AV$14:$AW$87,2)),\"\",VLOOKUP(AD109,$AV$14:$AW$87,2))","v":"Douglas"},{"$f":"IF(AD109=\"\",\"\",COUNTIF(AD:AD,AD109))","v":2},"DOU","NR0T/m","Mobile","CW/PH","17:40:00","18:26:40",7,{"$f":"IF(OR(AE109=\"\",AH109=\"\",AI109=\"\"),\"\",IF(AH109=\"part time\",\"\",AI109-AH109))","v":"00:46:40"}]
[null,null,null,null,null,null,null,null,null,null,null,null,null,null,null,null,null,null,null,null,null,null,null,null,null,{"$f":"IF(AB110=\"\",\"Z\",AB110)","v":"Burnett"}," ",{"$f":"IF(ISERROR(VLOOKUP(AD110,$AV$14:$AW$87,2)),\"\",VLOOKUP(AD110,$AV$14:$AW$87,2))","v":"Burnett"},{"$f":"IF(AD110=\"\",\"\",COUNTIF(AD:AD,AD110))","v":4},"BUR","NR0T/m","Mobile","CW/PH","18:26:40","19:13:20",8,{"$f":"IF(OR(AE110=\"\",AH110=\"\",AI110=\"\"),\"\",IF(AH110=\"part time\",\"\",AI110-AH110))","v":"00:46:40"}]
[null,null,null,null,null,null,null,null,null,null,null,null,null,null,null,null,null,null,null,null,null,null,null,null,null,{"$f":"IF(AB111=\"\",\"Z\",AB111)","v":"Polk"}," ",{"$f":"IF(ISERROR(VLOOKUP(AD111,$AV$14:$AW$87,2)),\"\",VLOOKUP(AD111,$AV$14:$AW$87,2))","v":"Polk"},{"$f":"IF(AD111=\"\",\"\",COUNTIF(AD:AD,AD111))","v":5},"POL","NR0T/m","Mobile","CW/PH","19:13:20","20:00:00",9,{"$f":"IF(OR(AE111=\"\",AH111=\"\",AI111=\"\"),\"\",IF(AH111=\"part time\",\"\",AI111-AH111))","v":"00:46:40"}]
[null,null,null,null,null,null,null,null,null,null,null,null,null,null,null,null,null,null,null,null,null,null,null,null,null,{"$f":"IF(AB112=\"\",\"Z\",AB112)","v":"Burnett"}," ",{"$f":"IF(ISERROR(VLOOKUP(AD112,$AV$14:$AW$87,2)),\"\",VLOOKUP(AD112,$AV$14:$AW$87,2))","v":"Burnett"},{"$f":"IF(AD112=\"\",\"\",COUNTIF(AD:AD,AD112))","v":4},"BUR","W0AA/m","Mobile","CW/PH","13:00:00","13:30:00",1,{"$f":"IF(OR(AE112=\"\",AH112=\"\",AI112=\"\"),\"\",IF(AH112=\"part time\",\"\",AI112-AH112))","v":"00:30:00"}]
[null,null,null,null,null,null,null,null,null,null,null,null,null,null,null,null,null,null,null,null,null,null,null,null,null,{"$f":"IF(AB113=\"\",\"Z\",AB113)","v":"Washburn"}," ",{"$f":"IF(ISERROR(VLOOKUP(AD113,$AV$14:$AW$87,2)),\"\",VLOOKUP(AD113,$AV$14:$AW$87,2))","v":"Washburn"},{"$f":"IF(AD113=\"\",\"\",COUNTIF(AD:AD,AD113))","v":4},"WSB","W0AA/m","Mobile","CW/PH","13:30:00","14:00:00",2,{"$f":"IF(OR(AE113=\"\",AH113=\"\",AI113=\"\"),\"\",IF(AH113=\"part time\",\"\",AI113-AH113))","v":"00:30:00"}]
[null,null,null,null,null,null,null,null,null,null,null,null,null,null,null,null,null,null,null,null,null,null,null,null,null,{"$f":"IF(AB114=\"\",\"Z\",AB114)","v":"Sawyer"}," ",{"$f":"IF(ISERROR(VLOOKUP(AD114,$AV$14:$AW$87,2)),\"\",VLOOKUP(AD114,$AV$14:$AW$87,2))","v":"Sawyer"},{"$f":"IF(AD114=\"\",\"\",COUNTIF(AD:AD,AD114))","v":4},"SAW","W0AA/m","Mobile","CW/PH","14:00:00","14:30:00",3,{"$f":"IF(OR(AE114=\"\",AH114=\"\",AI114=\"\"),\"\",IF(AH114=\"part time\",\"\",AI114-AH114))","v":"00:30:00"}]
[null,null,null,null,null,null,null,null,null,null,null,null,null,null,null,null,null,null,null,null,null,null,null,null,null,{"$f":"IF(AB115=\"\",\"Z\",AB115)","v":"Bayfield"}," ",{"$f":"IF(ISERROR(VLOOKUP(AD115,$AV$14:$AW$87,2)),\"\",VLOOKUP(AD115,$AV$14:$AW$87,2))","v":"Bayfield"},{"$f":"IF(AD115=\"\",\"\",COUNTIF(AD:AD,AD115))","v":3},"BAY","W0AA/m","Mobile","CW/PH","14:30:00","15:00:00",4,{"$f":"IF(OR(AE115=\"\",AH115=\"\",AI115=\"\"),\"\",IF(AH115=\"part time\",\"\",AI115-AH115))","v":"00:30:00"}]
[null,null,null,null,null,null,null,null,null,null,null,null,null,null,null,null,null,null,null,null,null,null,null,null,null,{"$f":"IF(AB116=\"\",\"Z\",AB116)","v":"Ashland"}," ",{"$f":"IF(ISERROR(VLOOKUP(AD116,$AV$14:$AW$87,2)),\"\",VLOOKUP(AD116,$AV$14:$AW$87,2))","v":"Ashland"},{"$f":"IF(AD116=\"\",\"\",COUNTIF(AD:AD,AD116))","v":1},"ASH","W0AA/m","Mobile","CW/PH","15:00:00","15:30:00",5,{"$f":"IF(OR(AE116=\"\",AH116=\"\",AI116=\"\"),\"\",IF(AH116=\"part time\",\"\",AI116-AH116))","v":"00:30:00"}]
[null,null,null,null,null,null,null,null,null,null,null,null,null,null,null,null,null,null,null,null,null,null,null,null,null,{"$f":"IF(AB117=\"\",\"Z\",AB117)","v":"Price"}," ",{"$f":"IF(ISERROR(VLOOKUP(AD117,$AV$14:$AW$87,2)),\"\",VLOOKUP(AD117,$AV$14:$AW$87,2))","v":"Price"},{"$f":"IF(AD117=\"\",\"\",COUNTIF(AD:AD,AD117))","v":2},"PRI","W0AA/m","Mobile","CW/PH","15:30:00","16:00:00",6,{"$f":"IF(OR(AE117=\"\",AH117=\"\",AI117=\"\"),\"\",IF(AH117=\"part time\",\"\",AI117-AH117))","v":"00:30:00"}]
[null,null,null,null,null,null,null,null,null,null,null,null,null,null,null,null,null,null,null,null,null,null,null,null,null,{"$f":"IF(AB118=\"\",\"Z\",AB118)","v":"Iron"}," ",{"$f":"IF(ISERROR(VLOOKUP(AD118,$AV$14:$AW$87,2)),\"\",VLOOKUP(AD118,$AV$14:$AW$87,2))","v":"Iron"},{"$f":"IF(AD118=\"\",\"\",COUNTIF(AD:AD,AD118))","v":1},"IRO","W0AA/m","Mobile","CW/PH","16:00:00","16:30:00",7,{"$f":"IF(OR(AE118=\"\",AH118=\"\",AI118=\"\"),\"\",IF(AH118=\"part time\",\"\",AI118-AH118))","v":"00:30:00"}]
[null,null,null,null,null,null,null,null,null,null,null,null,null,null,null,null,null,null,null,null,null,null,null,null,null,{"$f":"IF(AB119=\"\",\"Z\",AB119)","v":"Vilas"}," ",{"$f":"IF(ISERROR(VLOOKUP(AD119,$AV$14:$AW$87,2)),\"\",VLOOKUP(AD119,$AV$14:$AW$87,2))","v":"Vilas"},{"$f":"IF(AD119=\"\",\"\",COUNTIF(AD:AD,AD119))","v":1},"VIL","W0AA/m","Mobile","CW/PH","16:30:00","17:00:00",8,{"$f":"IF(OR(AE119=\"\",AH119=\"\",AI119=\"\"),\"\",IF(AH119=\"part time\",\"\",AI119-AH119))","v":"00:30:00"}]
[null,null,null,null,null,null,null,null,null,null,null,null,null,null,null,null,null,null,null,null,null,null,null,null,null,{"$f":"IF(AB120=\"\",\"Z\",AB120)","v":"Oneida"}," ",{"$f":"IF(ISERROR(VLOOKUP(AD120,$AV$14:$AW$87,2)),\"\",VLOOKUP(AD120,$AV$14:$AW$87,2))","v":"Oneida"},{"$f":"IF(AD120=\"\",\"\",COUNTIF(AD:AD,AD120))","v":1},"ONE","W0AA/m","Mobile","CW/PH","17:00:00","17:30:00",9,{"$f":"IF(OR(AE120=\"\",AH120=\"\",AI120=\"\"),\"\",IF(AH120=\"part time\",\"\",AI120-AH120))","v":"00:30:00"}]
[null,null,null,null,null,null,null,null,null,null,null,null,null,null,null,null,null,null,null,null,null,null,null,null,null,{"$f":"IF(AB121=\"\",\"Z\",AB121)","v":"Lincoln"}," ",{"$f":"IF(ISERROR(VLOOKUP(AD121,$AV$14:$AW$87,2)),\"\",VLOOKUP(AD121,$AV$14:$AW$87,2))","v":"Lincoln"},{"$f":"IF(AD121=\"\",\"\",COUNTIF(AD:AD,AD121))","v":2},"LIN","W0AA/m","Mobile","CW/PH","17:30:00","18:00:00",10,{"$f":"IF(OR(AE121=\"\",AH121=\"\",AI121=\"\"),\"\",IF(AH121=\"part time\",\"\",AI121-AH121))","v":"00:30:00"}]
[null,null,null,null,null,null,null,null,null,null,null,null,null,null,null,null,null,null,null,null,null,null,null,null,null,{"$f":"IF(AB122=\"\",\"Z\",AB122)","v":"Price"}," ",{"$f":"IF(ISERROR(VLOOKUP(AD122,$AV$14:$AW$87,2)),\"\",VLOOKUP(AD122,$AV$14:$AW$87,2))","v":"Price"},{"$f":"IF(AD122=\"\",\"\",COUNTIF(AD:AD,AD122))","v":2},"PRI","W0AA/m","Mobile","CW/PH","18:00:00","18:30:00",11,{"$f":"IF(OR(AE122=\"\",AH122=\"\",AI122=\"\"),\"\",IF(AH122=\"part time\",\"\",AI122-AH122))","v":"00:30:00"}]
[null,null,null,null,null,null,null,null,null,null,null,null,null,null,null,null,null,null,null,null,null,null,null,null,null,{"$f":"IF(AB123=\"\",\"Z\",AB123)","v":"Rusk"}," ",{"$f":"IF(ISERROR(VLOOKUP(AD123,$AV$14:$AW$87,2)),\"\",VLOOKUP(AD123,$AV$14:$AW$87,2))","v":"Rusk"},{"$f":"IF(AD123=\"\",\"\",COUNTIF(AD:AD,AD123))","v":3},"RUS","W0AA/m","Mobile","CW/PH","18:30:00","19:00:00",12,{"$f":"IF(OR(AE123=\"\",AH123=\"\",AI123=\"\"),\"\",IF(AH123=\"part time\",\"\",AI123-AH123))","v":"00:30:00"}]
[null,null,null,null,null,null,null,null,null,null,null,null,null,null,null,null,null,null,null,null,null,null,null,null,null,{"$f":"IF(AB124=\"\",\"Z\",AB124)","v":"Barron"}," ",{"$f":"IF(ISERROR(VLOOKUP(AD124,$AV$14:$AW$87,2)),\"\",VLOOKUP(AD124,$AV$14:$AW$87,2))","v":"Barron"},{"$f":"IF(AD124=\"\",\"\",COUNTIF(AD:AD,AD124))","v":5},"BAR","W0AA/m","Mobile","CW/PH","19:00:00","19:30:00",13,{"$f":"IF(OR(AE124=\"\",AH124=\"\",AI124=\"\"),\"\",IF(AH124=\"part time\",\"\",AI124-AH124))","v":"00:30:00"}]
[null,null,null,null,null,null,null,null,null,null,null,null,null,null,null,null,null,null,null,null,null,null,null,null,null,{"$f":"IF(AB125=\"\",\"Z\",AB125)","v":"Polk"}," ",{"$f":"IF(ISERROR(VLOOKUP(AD125,$AV$14:$AW$87,2)),\"\",VLOOKUP(AD125,$AV$14:$AW$87,2))","v":"Polk"},{"$f":"IF(AD125=\"\",\"\",COUNTIF(AD:AD,AD125))","v":5},"POL","W0AA/m","Mobile","CW/PH","19:30:00","20:00:00",14,{"$f":"IF(OR(AE125=\"\",AH125=\"\",AI125=\"\"),\"\",IF(AH125=\"part time\",\"\",AI125-AH125))","v":"00:30:00"}]
[null,null,null,null,null,null,null,null,null,null,null,null,null,null,null,null,null,null,null,null,null,null,null,null,null,{"$f":"IF(AB126=\"\",\"Z\",AB126)","v":"Chippewa"}," ",{"$f":"IF(ISERROR(VLOOKUP(AD126,$AV$14:$AW$87,2)),\"\",VLOOKUP(AD126,$AV$14:$AW$87,2))","v":"Chippewa"},{"$f":"IF(AD126=\"\",\"\",COUNTIF(AD:AD,AD126))","v":1},"CHP","W0ZQ/m","Mobile","CW/PH","13:00:00","13:50:00",1,{"$f":"IF(OR(AE126=\"\",AH126=\"\",AI126=\"\"),\"\",IF(AH126=\"part time\",\"\",AI126-AH126))","v":"00:50:00"}]
[null,null,null,null,null,null,null,null,null,null,null,null,null,null,null,null,null,null,null,null,null,null,null,null,null,{"$f":"IF(AB127=\"\",\"Z\",AB127)","v":"Taylor"}," ",{"$f":"IF(ISERROR(VLOOKUP(AD127,$AV$14:$AW$87,2)),\"\",VLOOKUP(AD127,$AV$14:$AW$87,2))","v":"Taylor"},{"$f":"IF(AD127=\"\",\"\",COUNTIF(AD:AD,AD127))","v":3},"TAY","W0ZQ/m","Mobile","CW/PH","13:50:00","14:40:00",2,{"$f":"IF(OR(AE127=\"\",AH127=\"\",AI127=\"\"),\"\",IF(AH127=\"part time\",\"\",AI127-AH127))","v":"00:50:00"}]
[null,null,null,null,null,null,null,null,null,null,null,null,null,null,null,null,null,null,null,null,null,null,null,null,null,{"$f":"IF(AB128=\"\",\"Z\",AB128)","v":"Clark"}," ",{"$f":"IF(ISERROR(VLOOKUP(AD128,$AV$14:$AW$87,2)),\"\",VLOOKUP(AD128,$AV$14:$AW$87,2))","v":"Clark"},{"$f":"IF(AD128=\"\",\"\",COUNTIF(AD:AD,AD128))","v":1},"CLK","W0ZQ/m","Mobile","CW/PH","14:40:00","16:05:00",3,{"$f":"IF(OR(AE128=\"\",AH128=\"\",AI128=\"\"),\"\",IF(AH128=\"part time\",\"\",AI128-AH128))","v":"01:25:00"}]
[null,null,null,null,null,null,null,null,null,null,null,null,null,null,null,null,null,null,null,null,null,null,null,null,null,{"$f":"IF(AB129=\"\",\"Z\",AB129)","v":"Eau Claire"}," ",{"$f":"IF(ISERROR(VLOOKUP(AD129,$AV$14:$AW$87,2)),\"\",VLOOKUP(AD129,$AV$14:$AW$87,2))","v":"Eau Claire"},{"$f":"IF(AD129=\"\",\"\",COUNTIF(AD:AD,AD129))","v":5},"EAU","W0ZQ/m","Mobile","CW/PH","16:05:00","17:10:00",4,{"$f":"IF(OR(AE129=\"\",AH129=\"\",AI129=\"\"),\"\",IF(AH129=\"part time\",\"\",AI129-AH129))","v":"01:05:00"}]
[null,null,null,null,null,null,null,null,null,null,null,null,null,null,null,null,null,null,null,null,null,null,null,null,null,{"$f":"IF(AB130=\"\",\"Z\",AB130)","v":"Dunn"}," ",{"$f":"IF(ISERROR(VLOOKUP(AD130,$AV$14:$AW$87,2)),\"\",VLOOKUP(AD130,$AV$14:$AW$87,2))","v":"Dunn"},{"$f":"IF(AD130=\"\",\"\",COUNTIF(AD:AD,AD130))","v":7},"DUN","W0ZQ/m","Mobile","CW/PH","17:10:00","18:20:00",5,{"$f":"IF(OR(AE130=\"\",AH130=\"\",AI130=\"\"),\"\",IF(AH130=\"part time\",\"\",AI130-AH130))","v":"01:10:00"}]
[null,null,null,null,null,null,null,null,null,null,null,null,null,null,null,null,null,null,null,null,null,null,null,null,null,{"$f":"IF(AB131=\"\",\"Z\",AB131)","v":"St Croix"}," ",{"$f":"IF(ISERROR(VLOOKUP(AD131,$AV$14:$AW$87,2)),\"\",VLOOKUP(AD131,$AV$14:$AW$87,2))","v":"St Croix"},{"$f":"IF(AD131=\"\",\"\",COUNTIF(AD:AD,AD131))","v":5},"STC","W0ZQ/m","Mobile","CW/PH","18:20:00","19:25:00",6,{"$f":"IF(OR(AE131=\"\",AH131=\"\",AI131=\"\"),\"\",IF(AH131=\"part time\",\"\",AI131-AH131))","v":"01:05:00"}]
[null,null,null,null,null,null,null,null,null,null,null,null,null,null,null,null,null,null,null,null,null,null,null,null,null,{"$f":"IF(AB132=\"\",\"Z\",AB132)","v":"Pierce"}," ",{"$f":"IF(ISERROR(VLOOKUP(AD132,$AV$14:$AW$87,2)),\"\",VLOOKUP(AD132,$AV$14:$AW$87,2))","v":"Pierce"},{"$f":"IF(AD132=\"\",\"\",COUNTIF(AD:AD,AD132))","v":1},"PIE","W0ZQ/m","Mobile","CW/PH","19:25:00","20:00:00",7,{"$f":"IF(OR(AE132=\"\",AH132=\"\",AI132=\"\"),\"\",IF(AH132=\"part time\",\"\",AI132-AH132))","v":"00:35:00"}]
[null,null,null,null,null,null,null,null,null,null,null,null,null,null,null,null,null,null,null,null,null,null,null,null,null,{"$f":"IF(AB133=\"\",\"Z\",AB133)","v":"Rock"}," ",{"$f":"IF(ISERROR(VLOOKUP(AD133,$AV$14:$AW$87,2)),\"\",VLOOKUP(AD133,$AV$14:$AW$87,2))","v":"Rock"},{"$f":"IF(AD133=\"\",\"\",COUNTIF(AD:AD,AD133))","v":2},"ROC","W9AFB/m","Mobile","PH","13:00:00","14:00:00",1,{"$f":"IF(OR(AE133=\"\",AH133=\"\",AI133=\"\"),\"\",IF(AH133=\"part time\",\"\",AI133-AH133))","v":"01:00:00"}]
[null,null,null,null,null,null,null,null,null,null,null,null,null,null,null,null,null,null,null,null,null,null,null,null,null,{"$f":"IF(AB134=\"\",\"Z\",AB134)","v":"Walworth"}," ",{"$f":"IF(ISERROR(VLOOKUP(AD134,$AV$14:$AW$87,2)),\"\",VLOOKUP(AD134,$AV$14:$AW$87,2))","v":"Walworth"},{"$f":"IF(AD134=\"\",\"\",COUNTIF(AD:AD,AD134))","v":2},"WAL","W9AFB/m","Mobile","PH","14:00:00","15:00:00",2,{"$f":"IF(OR(AE134=\"\",AH134=\"\",AI134=\"\"),\"\",IF(AH134=\"part time\",\"\",AI134-AH134))","v":"01:00:00"}]
[null,null,null,null,null,null,null,null,null,null,null,null,null,null,null,null,null,null,null,null,null,null,null,null,null,{"$f":"IF(AB135=\"\",\"Z\",AB135)","v":"Racine"}," ",{"$f":"IF(ISERROR(VLOOKUP(AD135,$AV$14:$AW$87,2)),\"\",VLOOKUP(AD135,$AV$14:$AW$87,2))","v":"Racine"},{"$f":"IF(AD135=\"\",\"\",COUNTIF(AD:AD,AD135))","v":2},"RAC","W9AFB/m","Mobile","PH","15:00:00","16:00:00",3,{"$f":"IF(OR(AE135=\"\",AH135=\"\",AI135=\"\"),\"\",IF(AH135=\"part time\",\"\",AI135-AH135))","v":"01:00:00"}]
[null,null,null,null,null,null,null,null,null,null,null,null,null,null,null,null,null,null,null,null,null,null,null,null,null,{"$f":"IF(AB136=\"\",\"Z\",AB136)","v":"Kenosha"}," ",{"$f":"IF(ISERROR(VLOOKUP(AD136,$AV$14:$AW$87,2)),\"\",VLOOKUP(AD136,$AV$14:$AW$87,2))","v":"Kenosha"},{"$f":"IF(AD136=\"\",\"\",COUNTIF(AD:AD,AD136))","v":2},"KEN","W9AFB/m","Mobile","PH","16:00:00","17:00:00",4,{"$f":"IF(OR(AE136=\"\",AH136=\"\",AI136=\"\"),\"\",IF(AH136=\"part time\",\"\",AI136-AH136))","v":"01:00:00"}]
[null,null,null,null,null,null,null,null,null,null,null,null,null,null,null,null,null,null,null,null,null,null,null,null,null,{"$f":"IF(AB137=\"\",\"Z\",AB137)","v":"Vernon"}," ",{"$f":"IF(ISERROR(VLOOKUP(AD137,$AV$14:$AW$87,2)),\"\",VLOOKUP(AD137,$AV$14:$AW$87,2))","v":"Vernon"},{"$f":"IF(AD137=\"\",\"\",COUNTIF(AD:AD,AD137))","v":1},"VER","W9FZ","Fixed","PH/CW","13:00:00","20:00:00",1,{"$f":"IF(OR(AE137=\"\",AH137=\"\",AI137=\"\"),\"\",IF(AH137=\"part time\",\"\",AI137-AH137))","v":"07:00:00"}]
[null,null,null,null,null,null,null,null,null,null,null,null,null,null,null,null,null,null,null,null,null,null,null,null,null,{"$f":"IF(AB138=\"\",\"Z\",AB138)","v":"Langlade"}," ",{"$f":"IF(ISERROR(VLOOKUP(AD138,$AV$14:$AW$87,2)),\"\",VLOOKUP(AD138,$AV$14:$AW$87,2))","v":"Langlade"},{"$f":"IF(AD138=\"\",\"\",COUNTIF(AD:AD,AD138))","v":2},"LAN","W9KF","Bonus","PH/CW","13:00:00","20:00:00",1,{"$f":"IF(OR(AE138=\"\",AH138=\"\",AI138=\"\"),\"\",IF(AH138=\"part time\",\"\",AI138-AH138))","v":"07:00:00"}]
[null,null,null,null,null,null,null,null,null,null,null,null,null,null,null,null,null,null,null,null,null,null,null,null,null,{"$f":"IF(AB139=\"\",\"Z\",AB139)","v":"Shawano"}," ",{"$f":"IF(ISERROR(VLOOKUP(AD139,$AV$14:$AW$87,2)),\"\",VLOOKUP(AD139,$AV$14:$AW$87,2))","v":"Shawano"},{"$f":"IF(AD139=\"\",\"\",COUNTIF(AD:AD,AD139))","v":5},"SHA","W9POI/m","Mobile","PH","13:00:00","13:42:00",1,{"$f":"IF(OR(AE139=\"\",AH139=\"\",AI139=\"\"),\"\",IF(AH139=\"part time\",\"\",AI139-AH139))","v":"00:42:00"}]
[null,null,null,null,null,null,null,null,null,null,null,null,null,null,null,null,null,null,null,null,null,null,null,null,null,{"$f":"IF(AB140=\"\",\"Z\",AB140)","v":"Outagamie"}," ",{"$f":"IF(ISERROR(VLOOKUP(AD140,$AV$14:$AW$87,2)),\"\",VLOOKUP(AD140,$AV$14:$AW$87,2))","v":"Outagamie"},{"$f":"IF(AD140=\"\",\"\",COUNTIF(AD:AD,AD140))","v":3},"OUT","W9POI/m","Mobile","PH","13:42:00","14:24:00",2,{"$f":"IF(OR(AE140=\"\",AH140=\"\",AI140=\"\"),\"\",IF(AH140=\"part time\",\"\",AI140-AH140))","v":"00:42:00"}]
[null,null,null,null,null,null,null,null,null,null,null,null,null,null,null,null,null,null,null,null,null,null,null,null,null,{"$f":"IF(AB141=\"\",\"Z\",AB141)","v":"Winnebago"}," ",{"$f":"IF(ISERROR(VLOOKUP(AD141,$AV$14:$AW$87,2)),\"\",VLOOKUP(AD141,$AV$14:$AW$87,2))","v":"Winnebago"},{"$f":"IF(AD141=\"\",\"\",COUNTIF(AD:AD,AD141))","v":4},"WIN","W9POI/m","Mobile","PH","14:24:00","15:06:00",3,{"$f":"IF(OR(AE141=\"\",AH141=\"\",AI141=\"\"),\"\",IF(AH141=\"part time\",\"\",AI141-AH141))","v":"00:42:00"}]
[null,null,null,null,null,null,null,null,null,null,null,null,null,null,null,null,null,null,null,null,null,null,null,null,null,{"$f":"IF(AB142=\"\",\"Z\",AB142)","v":"Fond du Lac"}," ",{"$f":"IF(ISERROR(VLOOKUP(AD142,$AV$14:$AW$87,2)),\"\",VLOOKUP(AD142,$AV$14:$AW$87,2))","v":"Fond du Lac"},{"$f":"IF(AD142=\"\",\"\",COUNTIF(AD:AD,AD142))","v":4},"FON","W9POI/m","Mobile","PH","15:06:00","15:48:00",4,{"$f":"IF(OR(AE142=\"\",AH142=\"\",AI142=\"\"),\"\",IF(AH142=\"part time\",\"\",AI142-AH142))","v":"00:42:00"}]
[null,null,null,null,null,null,null,null,null,null,null,null,null,null,null,null,null,null,null,null,null,null,null,null,null,{"$f":"IF(AB143=\"\",\"Z\",AB143)","v":"Green"}," ",{"$f":"IF(ISERROR(VLOOKUP(AD143,$AV$14:$AW$87,2)),\"\",VLOOKUP(AD143,$AV$14:$AW$87,2))","v":"Green"},{"$f":"IF(AD143=\"\",\"\",COUNTIF(AD:AD,AD143))","v":2},"GRE","W9POI/m","Mobile","PH","15:48:00","16:30:00",5,{"$f":"IF(OR(AE143=\"\",AH143=\"\",AI143=\"\"),\"\",IF(AH143=\"part time\",\"\",AI143-AH143))","v":"00:42:00"}]
[null,null,null,null,null,null,null,null,null,null,null,null,null,null,null,null,null,null,null,null,null,null,null,null,null,{"$f":"IF(AB144=\"\",\"Z\",AB144)","v":"Marquette"}," ",{"$f":"IF(ISERROR(VLOOKUP(AD144,$AV$14:$AW$87,2)),\"\",VLOOKUP(AD144,$AV$14:$AW$87,2))","v":"Marquette"},{"$f":"IF(AD144=\"\",\"\",COUNTIF(AD:AD,AD144))","v":3},"MRQ","W9POI/m","Mobile","PH","16:30:00","17:12:00",6,{"$f":"IF(OR(AE144=\"\",AH144=\"\",AI144=\"\"),\"\",IF(AH144=\"part time\",\"\",AI144-AH144))","v":"00:42:00"}]
[null,null,null,null,null,null,null,null,null,null,null,null,null,null,null,null,null,null,null,null,null,null,null,null,null,{"$f":"IF(AB145=\"\",\"Z\",AB145)","v":"Waushara"}," ",{"$f":"IF(ISERROR(VLOOKUP(AD145,$AV$14:$AW$87,2)),\"\",VLOOKUP(AD145,$AV$14:$AW$87,2))","v":"Waushara"},{"$f":"IF(AD145=\"\",\"\",COUNTIF(AD:AD,AD145))","v":4},"WSR","W9POI/m","Mobile","PH","17:12:00","17:54:00",7,{"$f":"IF(OR(AE145=\"\",AH145=\"\",AI145=\"\"),\"\",IF(AH145=\"part time\",\"\",AI145-AH145))","v":"00:42:00"}]
[null,null,null,null,null,null,null,null,null,null,null,null,null,null,null,null,null,null,null,null,null,null,null,null,null,{"$f":"IF(AB146=\"\",\"Z\",AB146)","v":"Adams"}," ",{"$f":"IF(ISERROR(VLOOKUP(AD146,$AV$14:$AW$87,2)),\"\",VLOOKUP(AD146,$AV$14:$AW$87,2))","v":"Adams"},{"$f":"IF(AD146=\"\",\"\",COUNTIF(AD:AD,AD146))","v":3},"ADA","W9POI/m","Mobile","PH","17:54:00","18:36:00",8,{"$f":"IF(OR(AE146=\"\",AH146=\"\",AI146=\"\"),\"\",IF(AH146=\"part time\",\"\",AI146-AH146))","v":"00:42:00"}]
[null,null,null,null,null,null,null,null,null,null,null,null,null,null,null,null,null,null,null,null,null,null,null,null,null,{"$f":"IF(AB147=\"\",\"Z\",AB147)","v":"Portage"}," ",{"$f":"IF(ISERROR(VLOOKUP(AD147,$AV$14:$AW$87,2)),\"\",VLOOKUP(AD147,$AV$14:$AW$87,2))","v":"Portage"},{"$f":"IF(AD147=\"\",\"\",COUNTIF(AD:AD,AD147))","v":5},"POR","W9POI/m","Mobile","PH","18:36:00","19:18:00",9,{"$f":"IF(OR(AE147=\"\",AH147=\"\",AI147=\"\"),\"\",IF(AH147=\"part time\",\"\",AI147-AH147))","v":"00:42:00"}]
[null,null,null,null,null,null,null,null,null,null,null,null,null,null,null,null,null,null,null,null,null,null,null,null,null,{"$f":"IF(AB148=\"\",\"Z\",AB148)","v":"Waupaca"}," ",{"$f":"IF(ISERROR(VLOOKUP(AD148,$AV$14:$AW$87,2)),\"\",VLOOKUP(AD148,$AV$14:$AW$87,2))","v":"Waupaca"},{"$f":"IF(AD148=\"\",\"\",COUNTIF(AD:AD,AD148))","v":4},"WAP","W9POI/m","Mobile","PH","19:18:00","20:00:00",10,{"$f":"IF(OR(AE148=\"\",AH148=\"\",AI148=\"\"),\"\",IF(AH148=\"part time\",\"\",AI148-AH148))","v":"00:42:00"}]
[null,null,null,null,null,null,null,null,null,null,null,null,null,null,null,null,null,null,null,null,null,null,null,null,null,{"$f":"IF(AB149=\"\",\"Z\",AB149)","v":"Waushara"}," ",{"$f":"IF(ISERROR(VLOOKUP(AD149,$AV$14:$AW$87,2)),\"\",VLOOKUP(AD149,$AV$14:$AW$87,2))","v":"Waushara"},{"$f":"IF(AD149=\"\",\"\",COUNTIF(AD:AD,AD149))","v":4},"WSR","WB8TFF","Fixed","PH","13:00:00","20:00:00",1,{"$f":"IF(OR(AE149=\"\",AH149=\"\",AI149=\"\"),\"\",IF(AH149=\"part time\",\"\",AI149-AH149))","v":"07:00:00"}]
[null,null,null,null,null,null,null,null,null,null,null,null,null,null,null,null,null,null,null,null,null,null,null,null,null,{"$f":"IF(AB150=\"\",\"Z\",AB150)","v":"Shawano"}," ",{"$f":"IF(ISERROR(VLOOKUP(AD150,$AV$14:$AW$87,2)),\"\",VLOOKUP(AD150,$AV$14:$AW$87,2))","v":"Shawano"},{"$f":"IF(AD150=\"\",\"\",COUNTIF(AD:AD,AD150))","v":5},"SHA","WB9OWN","Fixed","PH","13:00:00","20:00:00",null,{"$f":"IF(OR(AE150=\"\",AH150=\"\",AI150=\"\"),\"\",IF(AH150=\"part time\",\"\",AI150-AH150))","v":"07:00:00"}]
[null,null,null,null,null,null,null,null,null,null,null,null,null,null,null,null,null,null,null,null,null,null,null,null,null,{"$f":"IF(AB151=\"\",\"Z\",AB151)","v":"Milwaukee"}," ",{"$f":"IF(ISERROR(VLOOKUP(AD151,$AV$14:$AW$87,2)),\"\",VLOOKUP(AD151,$AV$14:$AW$87,2))","v":"Milwaukee"},{"$f":"IF(AD151=\"\",\"\",COUNTIF(AD:AD,AD151))","v":1},"MIL","WO9B/m","Mobile","CW/PH","13:00:00","13:26:15",1,{"$f":"IF(OR(AE151=\"\",AH151=\"\",AI151=\"\"),\"\",IF(AH151=\"part time\",\"\",AI151-AH151))","v":"00:26:15"}]
[null,null,null,null,null,null,null,null,null,null,null,null,null,null,null,null,null,null,null,null,null,null,null,null,null,{"$f":"IF(AB152=\"\",\"Z\",AB152)","v":"Washington"}," ",{"$f":"IF(ISERROR(VLOOKUP(AD152,$AV$14:$AW$87,2)),\"\",VLOOKUP(AD152,$AV$14:$AW$87,2))","v":"Washington"},{"$f":"IF(AD152=\"\",\"\",COUNTIF(AD:AD,AD152))","v":1},"WAS","WO9B/m","Mobile","CW/PH","13:26:15","13:52:30",2,{"$f":"IF(OR(AE152=\"\",AH152=\"\",AI152=\"\"),\"\",IF(AH152=\"part time\",\"\",AI152-AH152))","v":"00:26:15"}]
[null,null,null,null,null,null,null,null,null,null,null,null,null,null,null,null,null,null,null,null,null,null,null,null,null,{"$f":"IF(AB153=\"\",\"Z\",AB153)","v":"Ozaukee"}," ",{"$f":"IF(ISERROR(VLOOKUP(AD153,$AV$14:$AW$87,2)),\"\",VLOOKUP(AD153,$AV$14:$AW$87,2))","v":"Ozaukee"},{"$f":"IF(AD153=\"\",\"\",COUNTIF(AD:AD,AD153))","v":1},"OZA","WO9B/m","Mobile","CW/PH","13:52:30","14:18:45",3,{"$f":"IF(OR(AE153=\"\",AH153=\"\",AI153=\"\"),\"\",IF(AH153=\"part time\",\"\",AI153-AH153))","v":"00:26:15"}]
[null,null,null,null,null,null,null,null,null,null,null,null,null,null,null,null,null,null,null,null,null,null,null,null,null,{"$f":"IF(AB154=\"\",\"Z\",AB154)","v":"Sheboygan"}," ",{"$f":"IF(ISERROR(VLOOKUP(AD154,$AV$14:$AW$87,2)),\"\",VLOOKUP(AD154,$AV$14:$AW$87,2))","v":"Sheboygan"},{"$f":"IF(AD154=\"\",\"\",COUNTIF(AD:AD,AD154))","v":1},"SHE","WO9B/m","Mobile","CW/PH","14:18:45","14:45:00",4,{"$f":"IF(OR(AE154=\"\",AH154=\"\",AI154=\"\"),\"\",IF(AH154=\"part time\",\"\",AI154-AH154))","v":"00:26:15"}]
[null,null,null,null,null,null,null,null,null,null,null,null,null,null,null,null,null,null,null,null,null,null,null,null,null,{"$f":"IF(AB155=\"\",\"Z\",AB155)","v":"Fond du Lac"}," ",{"$f":"IF(ISERROR(VLOOKUP(AD155,$AV$14:$AW$87,2)),\"\",VLOOKUP(AD155,$AV$14:$AW$87,2))","v":"Fond du Lac"},{"$f":"IF(AD155=\"\",\"\",COUNTIF(AD:AD,AD155))","v":4},"FON","WO9B/m","Mobile","CW/PH","14:45:00","15:11:15",5,{"$f":"IF(OR(AE155=\"\",AH155=\"\",AI155=\"\"),\"\",IF(AH155=\"part time\",\"\",AI155-AH155))","v":"00:26:15"}]
[null,null,null,null,null,null,null,null,null,null,null,null,null,null,null,null,null,null,null,null,null,null,null,null,null,{"$f":"IF(AB156=\"\",\"Z\",AB156)","v":"Dodge"}," ",{"$f":"IF(ISERROR(VLOOKUP(AD156,$AV$14:$AW$87,2)),\"\",VLOOKUP(AD156,$AV$14:$AW$87,2))","v":"Dodge"},{"$f":"IF(AD156=\"\",\"\",COUNTIF(AD:AD,AD156))","v":1},"DOD","WO9B/m","Mobile","CW/PH","15:11:15","15:37:30",6,{"$f":"IF(OR(AE156=\"\",AH156=\"\",AI156=\"\"),\"\",IF(AH156=\"part time\",\"\",AI156-AH156))","v":"00:26:15"}]
[null,null,null,null,null,null,null,null,null,null,null,null,null,null,null,null,null,null,null,null,null,null,null,null,null,{"$f":"IF(AB157=\"\",\"Z\",AB157)","v":"Green Lake"}," ",{"$f":"IF(ISERROR(VLOOKUP(AD157,$AV$14:$AW$87,2)),\"\",VLOOKUP(AD157,$AV$14:$AW$87,2))","v":"Green Lake"},{"$f":"IF(AD157=\"\",\"\",COUNTIF(AD:AD,AD157))","v":3},"GRL","WO9B/m","Mobile","CW/PH","15:37:30","16:03:45",7,{"$f":"IF(OR(AE157=\"\",AH157=\"\",AI157=\"\"),\"\",IF(AH157=\"part time\",\"\",AI157-AH157))","v":"00:26:15"}]
[null,null,null,null,null,null,null,null,null,null,null,null,null,null,null,null,null,null,null,null,null,null,null,null,null,{"$f":"IF(AB158=\"\",\"Z\",AB158)","v":"Columbia"}," ",{"$f":"IF(ISERROR(VLOOKUP(AD158,$AV$14:$AW$87,2)),\"\",VLOOKUP(AD158,$AV$14:$AW$87,2))","v":"Columbia"},{"$f":"IF(AD158=\"\",\"\",COUNTIF(AD:AD,AD158))","v":1},"COL","WO9B/m","Mobile","CW/PH","16:03:45","16:30:00",8,{"$f":"IF(OR(AE158=\"\",AH158=\"\",AI158=\"\"),\"\",IF(AH158=\"part time\",\"\",AI158-AH158))","v":"00:26:15"}]
[null,null,null,null,null,null,null,null,null,null,null,null,null,null,null,null,null,null,null,null,null,null,null,null,null,{"$f":"IF(AB159=\"\",\"Z\",AB159)","v":"Dane"}," ",{"$f":"IF(ISERROR(VLOOKUP(AD159,$AV$14:$AW$87,2)),\"\",VLOOKUP(AD159,$AV$14:$AW$87,2))","v":"Dane"},{"$f":"IF(AD159=\"\",\"\",COUNTIF(AD:AD,AD159))","v":1},"DAN","WO9B/m","Mobile","CW/PH","16:30:00","16:56:15",9,{"$f":"IF(OR(AE159=\"\",AH159=\"\",AI159=\"\"),\"\",IF(AH159=\"part time\",\"\",AI159-AH159))","v":"00:26:15"}]
[null,null,null,null,null,null,null,null,null,null,null,null,null,null,null,null,null,null,null,null,null,null,null,null,null,{"$f":"IF(AB160=\"\",\"Z\",AB160)","v":"Green"}," ",{"$f":"IF(ISERROR(VLOOKUP(AD160,$AV$14:$AW$87,2)),\"\",VLOOKUP(AD160,$AV$14:$AW$87,2))","v":"Green"},{"$f":"IF(AD160=\"\",\"\",COUNTIF(AD:AD,AD160))","v":2},"GRE","WO9B/m","Mobile","CW/PH","16:56:15","17:22:30",10,{"$f":"IF(OR(AE160=\"\",AH160=\"\",AI160=\"\"),\"\",IF(AH160=\"part time\",\"\",AI160-AH160))","v":"00:26:15"}]
[null,null,null,null,null,null,null,null,null,null,null,null,null,null,null,null,null,null,null,null,null,null,null,null,null,{"$f":"IF(AB161=\"\",\"Z\",AB161)","v":"Rock"}," ",{"$f":"IF(ISERROR(VLOOKUP(AD161,$AV$14:$AW$87,2)),\"\",VLOOKUP(AD161,$AV$14:$AW$87,2))","v":"Rock"},{"$f":"IF(AD161=\"\",\"\",COUNTIF(AD:AD,AD161))","v":2},"ROC","WO9B/m","Mobile","CW/PH","17:22:30","17:48:45",11,{"$f":"IF(OR(AE161=\"\",AH161=\"\",AI161=\"\"),\"\",IF(AH161=\"part time\",\"\",AI161-AH161))","v":"00:26:15"}]
[null,null,null,null,null,null,null,null,null,null,null,null,null,null,null,null,null,null,null,null,null,null,null,null,null,{"$f":"IF(AB162=\"\",\"Z\",AB162)","v":"Jefferson"}," ",{"$f":"IF(ISERROR(VLOOKUP(AD162,$AV$14:$AW$87,2)),\"\",VLOOKUP(AD162,$AV$14:$AW$87,2))","v":"Jefferson"},{"$f":"IF(AD162=\"\",\"\",COUNTIF(AD:AD,AD162))","v":1},"JEF","WO9B/m","Mobile","CW/PH","17:48:45","18:15:00",12,{"$f":"IF(OR(AE162=\"\",AH162=\"\",AI162=\"\"),\"\",IF(AH162=\"part time\",\"\",AI162-AH162))","v":"00:26:15"}]
[null,null,null,null,null,null,null,null,null,null,null,null,null,null,null,null,null,null,null,null,null,null,null,null,null,{"$f":"IF(AB163=\"\",\"Z\",AB163)","v":"Walworth"}," ",{"$f":"IF(ISERROR(VLOOKUP(AD163,$AV$14:$AW$87,2)),\"\",VLOOKUP(AD163,$AV$14:$AW$87,2))","v":"Walworth"},{"$f":"IF(AD163=\"\",\"\",COUNTIF(AD:AD,AD163))","v":2},"WAL","WO9B/m","Mobile","CW/PH","18:15:00","18:41:15",13,{"$f":"IF(OR(AE163=\"\",AH163=\"\",AI163=\"\"),\"\",IF(AH163=\"part time\",\"\",AI163-AH163))","v":"00:26:15"}]
[null,null,null,null,null,null,null,null,null,null,null,null,null,null,null,null,null,null,null,null,null,null,null,null,null,{"$f":"IF(AB164=\"\",\"Z\",AB164)","v":"Kenosha"}," ",{"$f":"IF(ISERROR(VLOOKUP(AD164,$AV$14:$AW$87,2)),\"\",VLOOKUP(AD164,$AV$14:$AW$87,2))","v":"Kenosha"},{"$f":"IF(AD164=\"\",\"\",COUNTIF(AD:AD,AD164))","v":2},"KEN","WO9B/m","Mobile","CW/PH","18:41:15","19:07:30",14,{"$f":"IF(OR(AE164=\"\",AH164=\"\",AI164=\"\"),\"\",IF(AH164=\"part time\",\"\",AI164-AH164))","v":"00:26:15"}]
[null,null,null,null,null,null,null,null,null,null,null,null,null,null,null,null,null,null,null,null,null,null,null,null,null,{"$f":"IF(AB165=\"\",\"Z\",AB165)","v":"Racine"}," ",{"$f":"IF(ISERROR(VLOOKUP(AD165,$AV$14:$AW$87,2)),\"\",VLOOKUP(AD165,$AV$14:$AW$87,2))","v":"Racine"},{"$f":"IF(AD165=\"\",\"\",COUNTIF(AD:AD,AD165))","v":2},"RAC","WO9B/m","Mobile","CW/PH","19:07:30","19:33:45",15,{"$f":"IF(OR(AE165=\"\",AH165=\"\",AI165=\"\"),\"\",IF(AH165=\"part time\",\"\",AI165-AH165))","v":"00:26:15"}]
[null,null,null,null,null,null,null,null,null,null,null,null,null,null,null,null,null,null,null,null,null,null,null,null,null,{"$f":"IF(AB166=\"\",\"Z\",AB166)","v":"Waukesha"}," ",{"$f":"IF(ISERROR(VLOOKUP(AD166,$AV$14:$AW$87,2)),\"\",VLOOKUP(AD166,$AV$14:$AW$87,2))","v":"Waukesha"},{"$f":"IF(AD166=\"\",\"\",COUNTIF(AD:AD,AD166))","v":2},"WAU","WO9B/m","Mobile","CW/PH","19:33:45","20:00:00",16,{"$f":"IF(OR(AE166=\"\",AH166=\"\",AI166=\"\"),\"\",IF(AH166=\"part time\",\"\",AI166-AH166))","v":"00:26:15"}]
[null,null,null,null,null,null,null,null,null,null,null,null,null,null,null,null,null,null,null,null,null,null,null,null,null,{"$f":"IF(AB167=\"\",\"Z\",AB167)","v":"Z"}," ",{"$f":"IF(ISERROR(VLOOKUP(AD167,$AV$14:$AW$87,2)),\"\",VLOOKUP(AD167,$AV$14:$AW$87,2))","v":""},{"$f":"IF(AD167=\"\",\"\",COUNTIF(AD:AD,AD167))","v":""},null,null,null,null,null,null,null,{"$f":"IF(OR(AE167=\"\",AH167=\"\",AI167=\"\"),\"\",IF(AH167=\"part time\",\"\",AI167-AH167))","v":""}]
[null,null,null,null,null,null,null,null,null,null,null,null,null,null,null,null,null,null,null,null,null,null,null,null,null,{"$f":"IF(AB168=\"\",\"Z\",AB168)","v":"Z"}," ",{"$f":"IF(ISERROR(VLOOKUP(AD168,$AV$14:$AW$87,2)),\"\",VLOOKUP(AD168,$AV$14:$AW$87,2))","v":""},{"$f":"IF(AD168=\"\",\"\",COUNTIF(AD:AD,AD168))","v":""},null,null,null,null,null,null,null,{"$f":"IF(OR(AE168=\"\",AH168=\"\",AI168=\"\"),\"\",IF(AH168=\"part time\",\"\",AI168-AH168))","v":""}]
[null,null,null,null,null,null,null,null,null,null,null,null,null,null,null,null,null,null,null,null,null,null,null,null,null,{"$f":"IF(AB169=\"\",\"Z\",AB169)","v":"Z"}," ",{"$f":"IF(ISERROR(VLOOKUP(AD169,$AV$14:$AW$87,2)),\"\",VLOOKUP(AD169,$AV$14:$AW$87,2))","v":""},{"$f":"IF(AD169=\"\",\"\",COUNTIF(AD:AD,AD169))","v":""},null,null,null,null,null,null,null,{"$f":"IF(OR(AE169=\"\",AH169=\"\",AI169=\"\"),\"\",IF(AH169=\"part time\",\"\",AI169-AH169))","v":""}]
[null,null,null,null,null,null,null,null,null,null,null,null,null,null,null,null,null,null,null,null,null,null,null,null,null,{"$f":"IF(AB170=\"\",\"Z\",AB170)","v":"Z"}," ",{"$f":"IF(ISERROR(VLOOKUP(AD170,$AV$14:$AW$87,2)),\"\",VLOOKUP(AD170,$AV$14:$AW$87,2))","v":""},{"$f":"IF(AD170=\"\",\"\",COUNTIF(AD:AD,AD170))","v":""},null,null,null,null,null,null,null,{"$f":"IF(OR(AE170=\"\",AH170=\"\",AI170=\"\"),\"\",IF(AH170=\"part time\",\"\",AI170-AH170))","v":""}]
[null,null,null,null,null,null,null,null,null,null,null,null,null,null,null,null,null,null,null,null,null,null,null,null,null,{"$f":"IF(AB171=\"\",\"Z\",AB171)","v":"Z"}," ",{"$f":"IF(ISERROR(VLOOKUP(AD171,$AV$14:$AW$87,2)),\"\",VLOOKUP(AD171,$AV$14:$AW$87,2))","v":""},{"$f":"IF(AD171=\"\",\"\",COUNTIF(AD:AD,AD171))","v":""},null,null,null,null,null,null,null,{"$f":"IF(OR(AE171=\"\",AH171=\"\",AI171=\"\"),\"\",IF(AH171=\"part time\",\"\",AI171-AH171))","v":""}]
[null,null,null,null,null,null,null,null,null,null,null,null,null,null,null,null,null,null,null,null,null,null,null,null,null,{"$f":"IF(AB172=\"\",\"Z\",AB172)","v":"Z"}," ",{"$f":"IF(ISERROR(VLOOKUP(AD172,$AV$14:$AW$87,2)),\"\",VLOOKUP(AD172,$AV$14:$AW$87,2))","v":""},{"$f":"IF(AD172=\"\",\"\",COUNTIF(AD:AD,AD172))","v":""},null,null,null,null,null,null,null,{"$f":"IF(OR(AE172=\"\",AH172=\"\",AI172=\"\"),\"\",IF(AH172=\"part time\",\"\",AI172-AH172))","v":""}]
[null,null,null,null,null,null,null,null,null,null,null,null,null,null,null,null,null,null,null,null,null,null,null,null,null,{"$f":"IF(AB173=\"\",\"Z\",AB173)","v":"Z"}," ",{"$f":"IF(ISERROR(VLOOKUP(AD173,$AV$14:$AW$87,2)),\"\",VLOOKUP(AD173,$AV$14:$AW$87,2))","v":""},{"$f":"IF(AD173=\"\",\"\",COUNTIF(AD:AD,AD173))","v":""},null,null,null,null,null,null,null,{"$f":"IF(OR(AE173=\"\",AH173=\"\",AI173=\"\"),\"\",IF(AH173=\"part time\",\"\",AI173-AH173))","v":""}]
[null,null,null,null,null,null,null,null,null,null,null,null,null,null,null,null,null,null,null,null,null,null,null,null,null,{"$f":"IF(AB174=\"\",\"Z\",AB174)","v":"Z"}," ",{"$f":"IF(ISERROR(VLOOKUP(AD174,$AV$14:$AW$87,2)),\"\",VLOOKUP(AD174,$AV$14:$AW$87,2))","v":""},{"$f":"IF(AD174=\"\",\"\",COUNTIF(AD:AD,AD174))","v":""},null,null,null,null,null,null,null,{"$f":"IF(OR(AE174=\"\",AH174=\"\",AI174=\"\"),\"\",IF(AH174=\"part time\",\"\",AI174-AH174))","v":""}]
[null,null,null,null,null,null,null,null,null,null,null,null,null,null,null,null,null,null,null,null,null,null,null,null,null,{"$f":"IF(AB175=\"\",\"Z\",AB175)","v":"Z"}," ",{"$f":"IF(ISERROR(VLOOKUP(AD175,$AV$14:$AW$87,2)),\"\",VLOOKUP(AD175,$AV$14:$AW$87,2))","v":""},{"$f":"IF(AD175=\"\",\"\",COUNTIF(AD:AD,AD175))","v":""},null,null,null,null,null,null,null,{"$f":"IF(OR(AE175=\"\",AH175=\"\",AI175=\"\"),\"\",IF(AH175=\"part time\",\"\",AI175-AH175))","v":""}]
[null,null,null,null,null,null,null,null,null,null,null,null,null,null,null,null,null,null,null,null,null,null,null,null,null,{"$f":"IF(AB176=\"\",\"Z\",AB176)","v":"Z"}," ",{"$f":"IF(ISERROR(VLOOKUP(AD176,$AV$14:$AW$87,2)),\"\",VLOOKUP(AD176,$AV$14:$AW$87,2))","v":""},{"$f":"IF(AD176=\"\",\"\",COUNTIF(AD:AD,AD176))","v":""},null,null,null,null,null,null,null,{"$f":"IF(OR(AE176=\"\",AH176=\"\",AI176=\"\"),\"\",IF(AH176=\"part time\",\"\",AI176-AH176))","v":""}]
[null,null,null,null,null,null,null,null,null,null,null,null,null,null,null,null,null,null,null,null,null,null,null,null,null,{"$f":"IF(AB177=\"\",\"Z\",AB177)","v":"Z"}," ",{"$f":"IF(ISERROR(VLOOKUP(AD177,$AV$14:$AW$87,2)),\"\",VLOOKUP(AD177,$AV$14:$AW$87,2))","v":""},{"$f":"IF(AD177=\"\",\"\",COUNTIF(AD:AD,AD177))","v":""},null,null,null,null,null,null,null,{"$f":"IF(OR(AE177=\"\",AH177=\"\",AI177=\"\"),\"\",IF(AH177=\"part time\",\"\",AI177-AH177))","v":""}]
[null,null,null,null,null,null,null,null,null,null,null,null,null,null,null,null,null,null,null,null,null,null,null,null,null,{"$f":"IF(AB178=\"\",\"Z\",AB178)","v":"Z"}," ",{"$f":"IF(ISERROR(VLOOKUP(AD178,$AV$14:$AW$87,2)),\"\",VLOOKUP(AD178,$AV$14:$AW$87,2))","v":""},{"$f":"IF(AD178=\"\",\"\",COUNTIF(AD:AD,AD178))","v":""},null,null,null,null,null,null,null,{"$f":"IF(OR(AE178=\"\",AH178=\"\",AI178=\"\"),\"\",IF(AH178=\"part time\",\"\",AI178-AH178))","v":""}]
[null,null,null,null,null,null,null,null,null,null,null,null,null,null,null,null,null,null,null,null,null,null,null,null,null,{"$f":"IF(AB179=\"\",\"Z\",AB179)","v":"Z"}," ",{"$f":"IF(ISERROR(VLOOKUP(AD179,$AV$14:$AW$87,2)),\"\",VLOOKUP(AD179,$AV$14:$AW$87,2))","v":""},{"$f":"IF(AD179=\"\",\"\",COUNTIF(AD:AD,AD179))","v":""},null,null,null,null,null,null,null,{"$f":"IF(OR(AE179=\"\",AH179=\"\",AI179=\"\"),\"\",IF(AH179=\"part time\",\"\",AI179-AH179))","v":""}]
[null,null,null,null,null,null,null,null,null,null,null,null,null,null,null,null,null,null,null,null,null,null,null,null,null,{"$f":"IF(AB180=\"\",\"Z\",AB180)","v":"Z"}," ",{"$f":"IF(ISERROR(VLOOKUP(AD180,$AV$14:$AW$87,2)),\"\",VLOOKUP(AD180,$AV$14:$AW$87,2))","v":""},{"$f":"IF(AD180=\"\",\"\",COUNTIF(AD:AD,AD180))","v":""},null,null,null,null,null,null,null,{"$f":"IF(OR(AE180=\"\",AH180=\"\",AI180=\"\"),\"\",IF(AH180=\"part time\",\"\",AI180-AH180))","v":""}]
[null,null,null,null,null,null,null,null,null,null,null,null,null,null,null,null,null,null,null,null,null,null,null,null,null,{"$f":"IF(AB181=\"\",\"Z\",AB181)","v":"Z"}," ",{"$f":"IF(ISERROR(VLOOKUP(AD181,$AV$14:$AW$87,2)),\"\",VLOOKUP(AD181,$AV$14:$AW$87,2))","v":""},{"$f":"IF(AD181=\"\",\"\",COUNTIF(AD:AD,AD181))","v":""},null,null,null,null,null,null,null,{"$f":"IF(OR(AE181=\"\",AH181=\"\",AI181=\"\"),\"\",IF(AH181=\"part time\",\"\",AI181-AH181))","v":""}]
[null,null,null,null,null,null,null,null,null,null,null,null,null,null,null,null,null,null,null,null,null,null,null,null,null,{"$f":"IF(AB182=\"\",\"Z\",AB182)","v":"Z"}," ",{"$f":"IF(ISERROR(VLOOKUP(AD182,$AV$14:$AW$87,2)),\"\",VLOOKUP(AD182,$AV$14:$AW$87,2))","v":""},{"$f":"IF(AD182=\"\",\"\",COUNTIF(AD:AD,AD182))","v":""},null,null,null,null,null,null,null,{"$f":"IF(OR(AE182=\"\",AH182=\"\",AI182=\"\"),\"\",IF(AH182=\"part time\",\"\",AI182-AH182))","v":""}]
[null,null,null,null,null,null,null,null,null,null,null,null,null,null,null,null,null,null,null,null,null,null,null,null,null,{"$f":"IF(AB183=\"\",\"Z\",AB183)","v":"Z"}," ",{"$f":"IF(ISERROR(VLOOKUP(AD183,$AV$14:$AW$87,2)),\"\",VLOOKUP(AD183,$AV$14:$AW$87,2))","v":""},{"$f":"IF(AD183=\"\",\"\",COUNTIF(AD:AD,AD183))","v":""},null,null,null,null,null,null,null,{"$f":"IF(OR(AE183=\"\",AH183=\"\",AI183=\"\"),\"\",IF(AH183=\"part time\",\"\",AI183-AH183))","v":""}]
[null,null,null,null,null,null,null,null,null,null,null,null,null,null,null,null,null,null,null,null,null,null,null,null,null,{"$f":"IF(AB184=\"\",\"Z\",AB184)","v":"Z"}," ",{"$f":"IF(ISERROR(VLOOKUP(AD184,$AV$14:$AW$87,2)),\"\",VLOOKUP(AD184,$AV$14:$AW$87,2))","v":""},{"$f":"IF(AD184=\"\",\"\",COUNTIF(AD:AD,AD184))","v":""},null,null,null,null,null,null,null,{"$f":"IF(OR(AE184=\"\",AH184=\"\",AI184=\"\"),\"\",IF(AH184=\"part time\",\"\",AI184-AH184))","v":""}]
[null,null,null,null,null,null,null,null,null,null,null,null,null,null,null,null,null,null,null,null,null,null,null,null,null,{"$f":"IF(AB185=\"\",\"Z\",AB185)","v":"Z"}," ",{"$f":"IF(ISERROR(VLOOKUP(AD185,$AV$14:$AW$87,2)),\"\",VLOOKUP(AD185,$AV$14:$AW$87,2))","v":""},{"$f":"IF(AD185=\"\",\"\",COUNTIF(AD:AD,AD185))","v":""},null,null,null,null,null,null,null,{"$f":"IF(OR(AE185=\"\",AH185=\"\",AI185=\"\"),\"\",IF(AH185=\"part time\",\"\",AI185-AH185))","v":""}]
[null,null,null,null,null,null,null,null,null,null,null,null,null,null,null,null,null,null,null,null,null,null,null,null,null,{"$f":"IF(AB186=\"\",\"Z\",AB186)","v":"Z"}," ",{"$f":"IF(ISERROR(VLOOKUP(AD186,$AV$14:$AW$87,2)),\"\",VLOOKUP(AD186,$AV$14:$AW$87,2))","v":""},{"$f":"IF(AD186=\"\",\"\",COUNTIF(AD:AD,AD186))","v":""},null,null,null,null,null,null,null,{"$f":"IF(OR(AE186=\"\",AH186=\"\",AI186=\"\"),\"\",IF(AH186=\"part time\",\"\",AI186-AH186))","v":""}]
[null,null,null,null,null,null,null,null,null,null,null,null,null,null,null,null,null,null,null,null,null,null,null,null,null,{"$f":"IF(AB187=\"\",\"Z\",AB187)","v":"Z"}," ",{"$f":"IF(ISERROR(VLOOKUP(AD187,$AV$14:$AW$87,2)),\"\",VLOOKUP(AD187,$AV$14:$AW$87,2))","v":""},{"$f":"IF(AD187=\"\",\"\",COUNTIF(AD:AD,AD187))","v":""},null,null,null,null,null,null,null,{"$f":"IF(OR(AE187=\"\",AH187=\"\",AI187=\"\"),\"\",IF(AH187=\"part time\",\"\",AI187-AH187))","v":""}]
[null,null,null,null,null,null,null,null,null,null,null,null,null,null,null,null,null,null,null,null,null,null,null,null,null,{"$f":"IF(AB188=\"\",\"Z\",AB188)","v":"Z"}," ",{"$f":"IF(ISERROR(VLOOKUP(AD188,$AV$14:$AW$87,2)),\"\",VLOOKUP(AD188,$AV$14:$AW$87,2))","v":""},{"$f":"IF(AD188=\"\",\"\",COUNTIF(AD:AD,AD188))","v":""},null,null,null,null,null,null,null,{"$f":"IF(OR(AE188=\"\",AH188=\"\",AI188=\"\"),\"\",IF(AH188=\"part time\",\"\",AI188-AH188))","v":""}]
[null,null,null,null,null,null,null,null,null,null,null,null,null,null,null,null,null,null,null,null,null,null,null,null,null,{"$f":"IF(AB189=\"\",\"Z\",AB189)","v":"Z"}," ",{"$f":"IF(ISERROR(VLOOKUP(AD189,$AV$14:$AW$87,2)),\"\",VLOOKUP(AD189,$AV$14:$AW$87,2))","v":""},{"$f":"IF(AD189=\"\",\"\",COUNTIF(AD:AD,AD189))","v":""},null,null,null,null,null,null,null,{"$f":"IF(OR(AE189=\"\",AH189=\"\",AI189=\"\"),\"\",IF(AH189=\"part time\",\"\",AI189-AH189))","v":""}]
[null,null,null,null,null,null,null,null,null,null,null,null,null,null,null,null,null,null,null,null,null,null,null,null,null,{"$f":"IF(AB190=\"\",\"Z\",AB190)","v":"Z"}," ",{"$f":"IF(ISERROR(VLOOKUP(AD190,$AV$14:$AW$87,2)),\"\",VLOOKUP(AD190,$AV$14:$AW$87,2))","v":""},{"$f":"IF(AD190=\"\",\"\",COUNTIF(AD:AD,AD190))","v":""},null,null,null,null,null,null,null,{"$f":"IF(OR(AE190=\"\",AH190=\"\",AI190=\"\"),\"\",IF(AH190=\"part time\",\"\",AI190-AH190))","v":""}]
[null,null,null,null,null,null,null,null,null,null,null,null,null,null,null,null,null,null,null,null,null,null,null,null,null,{"$f":"IF(AB191=\"\",\"Z\",AB191)","v":"Z"}," ",{"$f":"IF(ISERROR(VLOOKUP(AD191,$AV$14:$AW$87,2)),\"\",VLOOKUP(AD191,$AV$14:$AW$87,2))","v":""},{"$f":"IF(AD191=\"\",\"\",COUNTIF(AD:AD,AD191))","v":""},null,null,null,null,null,null,null,{"$f":"IF(OR(AE191=\"\",AH191=\"\",AI191=\"\"),\"\",IF(AH191=\"part time\",\"\",AI191-AH191))","v":""}]
[null,null,null,null,null,null,null,null,null,null,null,null,null,null,null,null,null,null,null,null,null,null,null,null,null,{"$f":"IF(AB192=\"\",\"Z\",AB192)","v":"Z"}," ",{"$f":"IF(ISERROR(VLOOKUP(AD192,$AV$14:$AW$87,2)),\"\",VLOOKUP(AD192,$AV$14:$AW$87,2))","v":""},{"$f":"IF(AD192=\"\",\"\",COUNTIF(AD:AD,AD192))","v":""},null,null,null,null,null,null,null,{"$f":"IF(OR(AE192=\"\",AH192=\"\",AI192=\"\"),\"\",IF(AH192=\"part time\",\"\",AI192-AH192))","v":""}]
[null,null,null,null,null,null,null,null,null,null,null,null,null,null,null,null,null,null,null,null,null,null,null,null,null,{"$f":"IF(AB193=\"\",\"Z\",AB193)","v":"Z"}," ",{"$f":"IF(ISERROR(VLOOKUP(AD193,$AV$14:$AW$87,2)),\"\",VLOOKUP(AD193,$AV$14:$AW$87,2))","v":""},{"$f":"IF(AD193=\"\",\"\",COUNTIF(AD:AD,AD193))","v":""},null,null,null,null,null,null,null,{"$f":"IF(OR(AE193=\"\",AH193=\"\",AI193=\"\"),\"\",IF(AH193=\"part time\",\"\",AI193-AH193))","v":""}]
[null,null,null,null,null,null,null,null,null,null,null,null,null,null,null,null,null,null,null,null,null,null,null,null,null,{"$f":"IF(AB194=\"\",\"Z\",AB194)","v":"Z"}," ",{"$f":"IF(ISERROR(VLOOKUP(AD194,$AV$14:$AW$87,2)),\"\",VLOOKUP(AD194,$AV$14:$AW$87,2))","v":""},{"$f":"IF(AD194=\"\",\"\",COUNTIF(AD:AD,AD194))","v":""},null,null,null,null,null,null,null,{"$f":"IF(OR(AE194=\"\",AH194=\"\",AI194=\"\"),\"\",IF(AH194=\"part time\",\"\",AI194-AH194))","v":""}]
[null,null,null,null,null,null,null,null,null,null,null,null,null,null,null,null,null,null,null,null,null,null,null,null,null,{"$f":"IF(AB195=\"\",\"Z\",AB195)","v":"Z"}," ",{"$f":"IF(ISERROR(VLOOKUP(AD195,$AV$14:$AW$87,2)),\"\",VLOOKUP(AD195,$AV$14:$AW$87,2))","v":""},{"$f":"IF(AD195=\"\",\"\",COUNTIF(AD:AD,AD195))","v":""},null,null,null,null,null,null,null,{"$f":"IF(OR(AE195=\"\",AH195=\"\",AI195=\"\"),\"\",IF(AH195=\"part time\",\"\",AI195-AH195))","v":""}]
[null,null,null,null,null,null,null,null,null,null,null,null,null,null,null,null,null,null,null,null,null,null,null,null,null,{"$f":"IF(AB196=\"\",\"Z\",AB196)","v":"Z"}," ",{"$f":"IF(ISERROR(VLOOKUP(AD196,$AV$14:$AW$87,2)),\"\",VLOOKUP(AD196,$AV$14:$AW$87,2))","v":""},{"$f":"IF(AD196=\"\",\"\",COUNTIF(AD:AD,AD196))","v":""},null,null,null,null,null,null,null,{"$f":"IF(OR(AE196=\"\",AH196=\"\",AI196=\"\"),\"\",IF(AH196=\"part time\",\"\",AI196-AH196))","v":""}]
[null,null,null,null,null,null,null,null,null,null,null,null,null,null,null,null,null,null,null,null,null,null,null,null,null,{"$f":"IF(AB197=\"\",\"Z\",AB197)","v":"Z"}," ",{"$f":"IF(ISERROR(VLOOKUP(AD197,$AV$14:$AW$87,2)),\"\",VLOOKUP(AD197,$AV$14:$AW$87,2))","v":""},{"$f":"IF(AD197=\"\",\"\",COUNTIF(AD:AD,AD197))","v":""},null,null,null,null,null,null,null,{"$f":"IF(OR(AE197=\"\",AH197=\"\",AI197=\"\"),\"\",IF(AH197=\"part time\",\"\",AI197-AH197))","v":""}]
[null,null,null,null,null,null,null,null,null,null,null,null,null,null,null,null,null,null,null,null,null,null,null,null,null,{"$f":"IF(AB198=\"\",\"Z\",AB198)","v":"Z"}," ",{"$f":"IF(ISERROR(VLOOKUP(AD198,$AV$14:$AW$87,2)),\"\",VLOOKUP(AD198,$AV$14:$AW$87,2))","v":""},{"$f":"IF(AD198=\"\",\"\",COUNTIF(AD:AD,AD198))","v":""},null,null,null,null,null,null,null,{"$f":"IF(OR(AE198=\"\",AH198=\"\",AI198=\"\"),\"\",IF(AH198=\"part time\",\"\",AI198-AH198))","v":""}]
[null,null,null,null,null,null,null,null,null,null,null,null,null,null,null,null,null,null,null,null,null,null,null,null,null,{"$f":"IF(AB199=\"\",\"Z\",AB199)","v":"Z"}," ",{"$f":"IF(ISERROR(VLOOKUP(AD199,$AV$14:$AW$87,2)),\"\",VLOOKUP(AD199,$AV$14:$AW$87,2))","v":""},{"$f":"IF(AD199=\"\",\"\",COUNTIF(AD:AD,AD199))","v":""},null,null,null,null,null,null,null,{"$f":"IF(OR(AE199=\"\",AH199=\"\",AI199=\"\"),\"\",IF(AH199=\"part time\",\"\",AI199-AH199))","v":""}]
[null,null,null,null,null,null,null,null,null,null,null,null,null,null,null,null,null,null,null,null,null,null,null,null,null,{"$f":"IF(AB200=\"\",\"Z\",AB200)","v":"Z"}," ",{"$f":"IF(ISERROR(VLOOKUP(AD200,$AV$14:$AW$87,2)),\"\",VLOOKUP(AD200,$AV$14:$AW$87,2))","v":""},{"$f":"IF(AD200=\"\",\"\",COUNTIF(AD:AD,AD200))","v":""},null,null,null,null,null,null,null,{"$f":"IF(OR(AE200=\"\",AH200=\"\",AI200=\"\"),\"\",IF(AH200=\"part time\",\"\",AI200-AH200))","v":""}]
[null,null,null,null,null,null,null,null,null,null,null,null,null,null,null,null,null,null,null,null,null,null,null,null,null,{"$f":"IF(AB201=\"\",\"Z\",AB201)","v":"Z"}," ",{"$f":"IF(ISERROR(VLOOKUP(AD201,$AV$14:$AW$87,2)),\"\",VLOOKUP(AD201,$AV$14:$AW$87,2))","v":""},{"$f":"IF(AD201=\"\",\"\",COUNTIF(AD:AD,AD201))","v":""},null,null,null,null,null,null,null,{"$f":"IF(OR(AE201=\"\",AH201=\"\",AI201=\"\"),\"\",IF(AH201=\"part time\",\"\",AI201-AH201))","v":""}]
[null,null,null,null,null,null,null,null,null,null,null,null,null,null,null,null,null,null,null,null,null,null,null,null,null,{"$f":"IF(AB202=\"\",\"Z\",AB202)","v":"Z"}," ",{"$f":"IF(ISERROR(VLOOKUP(AD202,$AV$14:$AW$87,2)),\"\",VLOOKUP(AD202,$AV$14:$AW$87,2))","v":""},{"$f":"IF(AD202=\"\",\"\",COUNTIF(AD:AD,AD202))","v":""},null,null,null,null,null,null,null,{"$f":"IF(OR(AE202=\"\",AH202=\"\",AI202=\"\"),\"\",IF(AH202=\"part time\",\"\",AI202-AH202))","v":""}]
[null,null,null,null,null,null,null,null,null,null,null,null,null,null,null,null,null,null,null,null,null,null,null,null,null,{"$f":"IF(AB203=\"\",\"Z\",AB203)","v":"Z"}," ",{"$f":"IF(ISERROR(VLOOKUP(AD203,$AV$14:$AW$87,2)),\"\",VLOOKUP(AD203,$AV$14:$AW$87,2))","v":""},{"$f":"IF(AD203=\"\",\"\",COUNTIF(AD:AD,AD203))","v":""},null,null,null,null,null,null,null,{"$f":"IF(OR(AE203=\"\",AH203=\"\",AI203=\"\"),\"\",IF(AH203=\"part time\",\"\",AI203-AH203))","v":""}]
[null,null,null,null,null,null,null,null,null,null,null,null,null,null,null,null,null,null,null,null,null,null,null,null,null,{"$f":"IF(AB204=\"\",\"Z\",AB204)","v":"Z"}," ",{"$f":"IF(ISERROR(VLOOKUP(AD204,$AV$14:$AW$87,2)),\"\",VLOOKUP(AD204,$AV$14:$AW$87,2))","v":""},{"$f":"IF(AD204=\"\",\"\",COUNTIF(AD:AD,AD204))","v":""},null,null,null,null,null,null,null,{"$f":"IF(OR(AE204=\"\",AH204=\"\",AI204=\"\"),\"\",IF(AH204=\"part time\",\"\",AI204-AH204))","v":""}]
[null,null,null,null,null,null,null,null,null,null,null,null,null,null,null,null,null,null,null,null,null,null,null,null,null,{"$f":"IF(AB205=\"\",\"Z\",AB205)","v":"Z"}," ",{"$f":"IF(ISERROR(VLOOKUP(AD205,$AV$14:$AW$87,2)),\"\",VLOOKUP(AD205,$AV$14:$AW$87,2))","v":""},{"$f":"IF(AD205=\"\",\"\",COUNTIF(AD:AD,AD205))","v":""},null,null,null,null,null,null,null,{"$f":"IF(OR(AE205=\"\",AH205=\"\",AI205=\"\"),\"\",IF(AH205=\"part time\",\"\",AI205-AH205))","v":""}]
[null,null,null,null,null,null,null,null,null,null,null,null,null,null,null,null,null,null,null,null,null,null,null,null,null,{"$f":"IF(AB206=\"\",\"Z\",AB206)","v":"Z"}," ",{"$f":"IF(ISERROR(VLOOKUP(AD206,$AV$14:$AW$87,2)),\"\",VLOOKUP(AD206,$AV$14:$AW$87,2))","v":""},{"$f":"IF(AD206=\"\",\"\",COUNTIF(AD:AD,AD206))","v":""},null,null,null,null,null,null,null,{"$f":"IF(OR(AE206=\"\",AH206=\"\",AI206=\"\"),\"\",IF(AH206=\"part time\",\"\",AI206-AH206))","v":""}]
[null,null,null,null,null,null,null,null,null,null,null,null,null,null,null,null,null,null,null,null,null,null,null,null,null,{"$f":"IF(AB207=\"\",\"Z\",AB207)","v":"Z"}," ",{"$f":"IF(ISERROR(VLOOKUP(AD207,$AV$14:$AW$87,2)),\"\",VLOOKUP(AD207,$AV$14:$AW$87,2))","v":""},{"$f":"IF(AD207=\"\",\"\",COUNTIF(AD:AD,AD207))","v":""},null,null,null,null,null,null,null,{"$f":"IF(OR(AE207=\"\",AH207=\"\",AI207=\"\"),\"\",IF(AH207=\"part time\",\"\",AI207-AH207))","v":""}]
[null,null,null,null,null,null,null,null,null,null,null,null,null,null,null,null,null,null,null,null,null,null,null,null,null,{"$f":"IF(AB208=\"\",\"Z\",AB208)","v":"Z"}," ",{"$f":"IF(ISERROR(VLOOKUP(AD208,$AV$14:$AW$87,2)),\"\",VLOOKUP(AD208,$AV$14:$AW$87,2))","v":""},{"$f":"IF(AD208=\"\",\"\",COUNTIF(AD:AD,AD208))","v":""},null,null,null,null,null,null,null,{"$f":"IF(OR(AE208=\"\",AH208=\"\",AI208=\"\"),\"\",IF(AH208=\"part time\",\"\",AI208-AH208))","v":""}]
[null,null,null,null,null,null,null,null,null,null,null,null,null,null,null,null,null,null,null,null,null,null,null,null,null,{"$f":"IF(AB209=\"\",\"Z\",AB209)","v":"Z"}," ",{"$f":"IF(ISERROR(VLOOKUP(AD209,$AV$14:$AW$87,2)),\"\",VLOOKUP(AD209,$AV$14:$AW$87,2))","v":""},{"$f":"IF(AD209=\"\",\"\",COUNTIF(AD:AD,AD209))","v":""},null,null,null,null,null,null,null,{"$f":"IF(OR(AE209=\"\",AH209=\"\",AI209=\"\"),\"\",IF(AH209=\"part time\",\"\",AI209-AH209))","v":""}]
[null,null,null,null,null,null,null,null,null,null,null,null,null,null,null,null,null,null,null,null,null,null,null,null,null,{"$f":"IF(AB210=\"\",\"Z\",AB210)","v":"Z"}," ",{"$f":"IF(ISERROR(VLOOKUP(AD210,$AV$14:$AW$87,2)),\"\",VLOOKUP(AD210,$AV$14:$AW$87,2))","v":""},{"$f":"IF(AD210=\"\",\"\",COUNTIF(AD:AD,AD210))","v":""},null,null,null,null,null,null,null,{"$f":"IF(OR(AE210=\"\",AH210=\"\",AI210=\"\"),\"\",IF(AH210=\"part time\",\"\",AI210-AH210))","v":""}]
[null,null,null,null,null,null,null,null,null,null,null,null,null,null,null,null,null,null,null,null,null,null,null,null,null,{"$f":"IF(AB211=\"\",\"Z\",AB211)","v":"Z"}," ",{"$f":"IF(ISERROR(VLOOKUP(AD211,$AV$14:$AW$87,2)),\"\",VLOOKUP(AD211,$AV$14:$AW$87,2))","v":""},{"$f":"IF(AD211=\"\",\"\",COUNTIF(AD:AD,AD211))","v":""},null,null,null,null,null,null,null,{"$f":"IF(OR(AE211=\"\",AH211=\"\",AI211=\"\"),\"\",IF(AH211=\"part time\",\"\",AI211-AH211))","v":""}]
[null,null,null,null,null,null,null,null,null,null,null,null,null,null,null,null,null,null,null,null,null,null,null,null,null,{"$f":"IF(AB212=\"\",\"Z\",AB212)","v":"Z"}," ",{"$f":"IF(ISERROR(VLOOKUP(AD212,$AV$14:$AW$87,2)),\"\",VLOOKUP(AD212,$AV$14:$AW$87,2))","v":""},{"$f":"IF(AD212=\"\",\"\",COUNTIF(AD:AD,AD212))","v":""},null,null,null,null,null,null,null,{"$f":"IF(OR(AE212=\"\",AH212=\"\",AI212=\"\"),\"\",IF(AH212=\"part time\",\"\",AI212-AH212))","v":""}]
[null,null,null,null,null,null,null,null,null,null,null,null,null,null,null,null,null,null,null,null,null,null,null,null,null,{"$f":"IF(AB213=\"\",\"Z\",AB213)","v":"Z"}," ",{"$f":"IF(ISERROR(VLOOKUP(AD213,$AV$14:$AW$87,2)),\"\",VLOOKUP(AD213,$AV$14:$AW$87,2))","v":""},{"$f":"IF(AD213=\"\",\"\",COUNTIF(AD:AD,AD213))","v":""},null,null,null,null,null,null,null,{"$f":"IF(OR(AE213=\"\",AH213=\"\",AI213=\"\"),\"\",IF(AH213=\"part time\",\"\",AI213-AH213))","v":""}]
[null,null,null,null,null,null,null,null,null,null,null,null,null,null,null,null,null,null,null,null,null,null,null,null,null,{"$f":"IF(AB214=\"\",\"Z\",AB214)","v":"Z"}," ",{"$f":"IF(ISERROR(VLOOKUP(AD214,$AV$14:$AW$87,2)),\"\",VLOOKUP(AD214,$AV$14:$AW$87,2))","v":""},{"$f":"IF(AD214=\"\",\"\",COUNTIF(AD:AD,AD214))","v":""},null,null,null,null,null,null,null,{"$f":"IF(OR(AE214=\"\",AH214=\"\",AI214=\"\"),\"\",IF(AH214=\"part time\",\"\",AI214-AH214))","v":""}]
[null,null,null,null,null,null,null,null,null,null,null,null,null,null,null,null,null,null,null,null,null,null,null,null,null,{"$f":"IF(AB215=\"\",\"Z\",AB215)","v":"Z"}," ",{"$f":"IF(ISERROR(VLOOKUP(AD215,$AV$14:$AW$87,2)),\"\",VLOOKUP(AD215,$AV$14:$AW$87,2))","v":""},{"$f":"IF(AD215=\"\",\"\",COUNTIF(AD:AD,AD215))","v":""},null,null,null,null,null,null,null,{"$f":"IF(OR(AE215=\"\",AH215=\"\",AI215=\"\"),\"\",IF(AH215=\"part time\",\"\",AI215-AH215))","v":""}]
[null,null,null,null,null,null,null,null,null,null,null,null,null,null,null,null,null,null,null,null,null,null,null,null,null,{"$f":"IF(AB216=\"\",\"Z\",AB216)","v":"Z"}," ",{"$f":"IF(ISERROR(VLOOKUP(AD216,$AV$14:$AW$87,2)),\"\",VLOOKUP(AD216,$AV$14:$AW$87,2))","v":""},{"$f":"IF(AD216=\"\",\"\",COUNTIF(AD:AD,AD216))","v":""},null,null,null,null,null,null,null,{"$f":"IF(OR(AE216=\"\",AH216=\"\",AI216=\"\"),\"\",IF(AH216=\"part time\",\"\",AI216-AH216))","v":""}]
[null,null,null,null,null,null,null,null,null,null,null,null,null,null,null,null,null,null,null,null,null,null,null,null,null,{"$f":"IF(AB217=\"\",\"Z\",AB217)","v":"Z"}," ",{"$f":"IF(ISERROR(VLOOKUP(AD217,$AV$14:$AW$87,2)),\"\",VLOOKUP(AD217,$AV$14:$AW$87,2))","v":""},{"$f":"IF(AD217=\"\",\"\",COUNTIF(AD:AD,AD217))","v":""},null,null,null,null,null,null,null,{"$f":"IF(OR(AE217=\"\",AH217=\"\",AI217=\"\"),\"\",IF(AH217=\"part time\",\"\",AI217-AH217))","v":""}]
[null,null,null,null,null,null,null,null,null,null,null,null,null,null,null,null,null,null,null,null,null,null,null,null,null,{"$f":"IF(AB218=\"\",\"Z\",AB218)","v":"Z"}," ",{"$f":"IF(ISERROR(VLOOKUP(AD218,$AV$14:$AW$87,2)),\"\",VLOOKUP(AD218,$AV$14:$AW$87,2))","v":""},{"$f":"IF(AD218=\"\",\"\",COUNTIF(AD:AD,AD218))","v":""},null,null,null,null,null,null,null,{"$f":"IF(OR(AE218=\"\",AH218=\"\",AI218=\"\"),\"\",IF(AH218=\"part time\",\"\",AI218-AH218))","v":""}]
[null,null,null,null,null,null,null,null,null,null,null,null,null,null,null,null,null,null,null,null,null,null,null,null,null,{"$f":"IF(AB219=\"\",\"Z\",AB219)","v":"Z"}," ",{"$f":"IF(ISERROR(VLOOKUP(AD219,$AV$14:$AW$87,2)),\"\",VLOOKUP(AD219,$AV$14:$AW$87,2))","v":""},{"$f":"IF(AD219=\"\",\"\",COUNTIF(AD:AD,AD219))","v":""},null,null,null,null,null,null,null,{"$f":"IF(OR(AE219=\"\",AH219=\"\",AI219=\"\"),\"\",IF(AH219=\"part time\",\"\",AI219-AH219))","v":""}]
[null,null,null,null,null,null,null,null,null,null,null,null,null,null,null,null,null,null,null,null,null,null,null,null,null,{"$f":"IF(AB220=\"\",\"Z\",AB220)","v":"Z"}," ",{"$f":"IF(ISERROR(VLOOKUP(AD220,$AV$14:$AW$87,2)),\"\",VLOOKUP(AD220,$AV$14:$AW$87,2))","v":""},{"$f":"IF(AD220=\"\",\"\",COUNTIF(AD:AD,AD220))","v":""},null,null,null,null,null,null,null,{"$f":"IF(OR(AE220=\"\",AH220=\"\",AI220=\"\"),\"\",IF(AH220=\"part time\",\"\",AI220-AH220))","v":""}]
[null,null,null,null,null,null,null,null,null,null,null,null,null,null,null,null,null,null,null,null,null,null,null,null,null,{"$f":"IF(AB221=\"\",\"Z\",AB221)","v":"Z"}," ",{"$f":"IF(ISERROR(VLOOKUP(AD221,$AV$14:$AW$87,2)),\"\",VLOOKUP(AD221,$AV$14:$AW$87,2))","v":""},{"$f":"IF(AD221=\"\",\"\",COUNTIF(AD:AD,AD221))","v":""},null,null,null,null,null,null,null,{"$f":"IF(OR(AE221=\"\",AH221=\"\",AI221=\"\"),\"\",IF(AH221=\"part time\",\"\",AI221-AH221))","v":""}]
[null,null,null,null,null,null,null,null,null,null,null,null,null,null,null,null,null,null,null,null,null,null,null,null,null,{"$f":"IF(AB222=\"\",\"Z\",AB222)","v":"Z"}," ",{"$f":"IF(ISERROR(VLOOKUP(AD222,$AV$14:$AW$87,2)),\"\",VLOOKUP(AD222,$AV$14:$AW$87,2))","v":""},{"$f":"IF(AD222=\"\",\"\",COUNTIF(AD:AD,AD222))","v":""},null,null,null,null,null,null,null,{"$f":"IF(OR(AE222=\"\",AH222=\"\",AI222=\"\"),\"\",IF(AH222=\"part time\",\"\",AI222-AH222))","v":""}]
[null,null,null,null,null,null,null,null,null,null,null,null,null,null,null,null,null,null,null,null,null,null,null,null,null,{"$f":"IF(AB223=\"\",\"Z\",AB223)","v":"Z"}," ",{"$f":"IF(ISERROR(VLOOKUP(AD223,$AV$14:$AW$87,2)),\"\",VLOOKUP(AD223,$AV$14:$AW$87,2))","v":""},{"$f":"IF(AD223=\"\",\"\",COUNTIF(AD:AD,AD223))","v":""},null,null,null,null,null,null,null,{"$f":"IF(OR(AE223=\"\",AH223=\"\",AI223=\"\"),\"\",IF(AH223=\"part time\",\"\",AI223-AH223))","v":""}]
[null,null,null,null,null,null,null,null,null,null,null,null,null,null,null,null,null,null,null,null,null,null,null,null,null,{"$f":"IF(AB224=\"\",\"Z\",AB224)","v":"Z"}," ",{"$f":"IF(ISERROR(VLOOKUP(AD224,$AV$14:$AW$87,2)),\"\",VLOOKUP(AD224,$AV$14:$AW$87,2))","v":""},{"$f":"IF(AD224=\"\",\"\",COUNTIF(AD:AD,AD224))","v":""},null,null,null,null,null,null,null,{"$f":"IF(OR(AE224=\"\",AH224=\"\",AI224=\"\"),\"\",IF(AH224=\"part time\",\"\",AI224-AH224))","v":""}]
[null,null,null,null,null,null,null,null,null,null,null,null,null,null,null,null,null,null,null,null,null,null,null,null,null,{"$f":"IF(AB225=\"\",\"Z\",AB225)","v":"Z"}," ",{"$f":"IF(ISERROR(VLOOKUP(AD225,$AV$14:$AW$87,2)),\"\",VLOOKUP(AD225,$AV$14:$AW$87,2))","v":""},{"$f":"IF(AD225=\"\",\"\",COUNTIF(AD:AD,AD225))","v":""},null,null,null,null,null,null,null,{"$f":"IF(OR(AE225=\"\",AH225=\"\",AI225=\"\"),\"\",IF(AH225=\"part time\",\"\",AI225-AH225))","v":""}]
[null,null,null,null,null,null,null,null,null,null,null,null,null,null,null,null,null,null,null,null,null,null,null,null,null,{"$f":"IF(AB226=\"\",\"Z\",AB226)","v":"Z"}," ",{"$f":"IF(ISERROR(VLOOKUP(AD226,$AV$14:$AW$87,2)),\"\",VLOOKUP(AD226,$AV$14:$AW$87,2))","v":""},{"$f":"IF(AD226=\"\",\"\",COUNTIF(AD:AD,AD226))","v":""},null,null,null,null,null,null,null,{"$f":"IF(OR(AE226=\"\",AH226=\"\",AI226=\"\"),\"\",IF(AH226=\"part time\",\"\",AI226-AH226))","v":""}]
[null,null,null,null,null,null,null,null,null,null,null,null,null,null,null,null,null,null,null,null,null,null,null,null,null,{"$f":"IF(AB227=\"\",\"Z\",AB227)","v":"Z"}," ",{"$f":"IF(ISERROR(VLOOKUP(AD227,$AV$14:$AW$87,2)),\"\",VLOOKUP(AD227,$AV$14:$AW$87,2))","v":""},{"$f":"IF(AD227=\"\",\"\",COUNTIF(AD:AD,AD227))","v":""},null,null,null,null,null,null,null,{"$f":"IF(OR(AE227=\"\",AH227=\"\",AI227=\"\"),\"\",IF(AH227=\"part time\",\"\",AI227-AH227))","v":""}]
[null,null,null,null,null,null,null,null,null,null,null,null,null,null,null,null,null,null,null,null,null,null,null,null,null,{"$f":"IF(AB228=\"\",\"Z\",AB228)","v":"Z"}," ",{"$f":"IF(ISERROR(VLOOKUP(AD228,$AV$14:$AW$87,2)),\"\",VLOOKUP(AD228,$AV$14:$AW$87,2))","v":""},{"$f":"IF(AD228=\"\",\"\",COUNTIF(AD:AD,AD228))","v":""},null,null,null,null,null,null,null,{"$f":"IF(OR(AE228=\"\",AH228=\"\",AI228=\"\"),\"\",IF(AH228=\"part time\",\"\",AI228-AH228))","v":""}]
[null,null,null,null,null,null,null,null,null,null,null,null,null,null,null,null,null,null,null,null,null,null,null,null,null,{"$f":"IF(AB229=\"\",\"Z\",AB229)","v":"Z"}," ",{"$f":"IF(ISERROR(VLOOKUP(AD229,$AV$14:$AW$87,2)),\"\",VLOOKUP(AD229,$AV$14:$AW$87,2))","v":""},{"$f":"IF(AD229=\"\",\"\",COUNTIF(AD:AD,AD229))","v":""},null,null,null,null,null,null,null,{"$f":"IF(OR(AE229=\"\",AH229=\"\",AI229=\"\"),\"\",IF(AH229=\"part time\",\"\",AI229-AH229))","v":""}]
[null,null,null,null,null,null,null,null,null,null,null,null,null,null,null,null,null,null,null,null,null,null,null,null,null,{"$f":"IF(AB230=\"\",\"Z\",AB230)","v":"Z"}," ",{"$f":"IF(ISERROR(VLOOKUP(AD230,$AV$14:$AW$87,2)),\"\",VLOOKUP(AD230,$AV$14:$AW$87,2))","v":""},{"$f":"IF(AD230=\"\",\"\",COUNTIF(AD:AD,AD230))","v":""},null,null,null,null,null,null,null,{"$f":"IF(OR(AE230=\"\",AH230=\"\",AI230=\"\"),\"\",IF(AH230=\"part time\",\"\",AI230-AH230))","v":""}]
[null,null,null,null,null,null,null,null,null,null,null,null,null,null,null,null,null,null,null,null,null,null,null,null,null,{"$f":"IF(AB231=\"\",\"Z\",AB231)","v":"Z"}," ",{"$f":"IF(ISERROR(VLOOKUP(AD231,$AV$14:$AW$87,2)),\"\",VLOOKUP(AD231,$AV$14:$AW$87,2))","v":""},{"$f":"IF(AD231=\"\",\"\",COUNTIF(AD:AD,AD231))","v":""},null,null,null,null,null,null,null,{"$f":"IF(OR(AE231=\"\",AH231=\"\",AI231=\"\"),\"\",IF(AH231=\"part time\",\"\",AI231-AH231))","v":""}]
[null,null,null,null,null,null,null,null,null,null,null,null,null,null,null,null,null,null,null,null,null,null,null,null,null,{"$f":"IF(AB232=\"\",\"Z\",AB232)","v":"Z"}," ",{"$f":"IF(ISERROR(VLOOKUP(AD232,$AV$14:$AW$87,2)),\"\",VLOOKUP(AD232,$AV$14:$AW$87,2))","v":""},{"$f":"IF(AD232=\"\",\"\",COUNTIF(AD:AD,AD232))","v":""},null,null,null,null,null,null,null,{"$f":"IF(OR(AE232=\"\",AH232=\"\",AI232=\"\"),\"\",IF(AH232=\"part time\",\"\",AI232-AH232))","v":""}]
[null,null,null,null,null,null,null,null,null,null,null,null,null,null,null,null,null,null,null,null,null,null,null,null,null,{"$f":"IF(AB233=\"\",\"Z\",AB233)","v":"Z"}," ",{"$f":"IF(ISERROR(VLOOKUP(AD233,$AV$14:$AW$87,2)),\"\",VLOOKUP(AD233,$AV$14:$AW$87,2))","v":""},{"$f":"IF(AD233=\"\",\"\",COUNTIF(AD:AD,AD233))","v":""},null,null,null,null,null,null,null,{"$f":"IF(OR(AE233=\"\",AH233=\"\",AI233=\"\"),\"\",IF(AH233=\"part time\",\"\",AI233-AH233))","v":""}]
[null,null,null,null,null,null,null,null,null,null,null,null,null,null,null,null,null,null,null,null,null,null,null,null,null,{"$f":"IF(AB234=\"\",\"Z\",AB234)","v":"Z"}," ",{"$f":"IF(ISERROR(VLOOKUP(AD234,$AV$14:$AW$87,2)),\"\",VLOOKUP(AD234,$AV$14:$AW$87,2))","v":""},{"$f":"IF(AD234=\"\",\"\",COUNTIF(AD:AD,AD234))","v":""},null,null,null,null,null,null,null,{"$f":"IF(OR(AE234=\"\",AH234=\"\",AI234=\"\"),\"\",IF(AH234=\"part time\",\"\",AI234-AH234))","v":""}]
[null,null,null,null,null,null,null,null,null,null,null,null,null,null,null,null,null,null,null,null,null,null,null,null,null,{"$f":"IF(AB235=\"\",\"Z\",AB235)","v":"Z"}," ",{"$f":"IF(ISERROR(VLOOKUP(AD235,$AV$14:$AW$87,2)),\"\",VLOOKUP(AD235,$AV$14:$AW$87,2))","v":""},{"$f":"IF(AD235=\"\",\"\",COUNTIF(AD:AD,AD235))","v":""},null,null,null,null,null,null,null,{"$f":"IF(OR(AE235=\"\",AH235=\"\",AI235=\"\"),\"\",IF(AH235=\"part time\",\"\",AI235-AH235))","v":""}]
[null,null,null,null,null,null,null,null,null,null,null,null,null,null,null,null,null,null,null,null,null,null,null,null,null,{"$f":"IF(AB236=\"\",\"Z\",AB236)","v":"Z"}," ",{"$f":"IF(ISERROR(VLOOKUP(AD236,$AV$14:$AW$87,2)),\"\",VLOOKUP(AD236,$AV$14:$AW$87,2))","v":""},{"$f":"IF(AD236=\"\",\"\",COUNTIF(AD:AD,AD236))","v":""},null,null,null,null,null,null,null,{"$f":"IF(OR(AE236=\"\",AH236=\"\",AI236=\"\"),\"\",IF(AH236=\"part time\",\"\",AI236-AH236))","v":""}]
[null,null,null,null,null,null,null,null,null,null,null,null,null,null,null,null,null,null,null,null,null,null,null,null,null,{"$f":"IF(AB237=\"\",\"Z\",AB237)","v":"Z"}," ",{"$f":"IF(ISERROR(VLOOKUP(AD237,$AV$14:$AW$87,2)),\"\",VLOOKUP(AD237,$AV$14:$AW$87,2))","v":""},{"$f":"IF(AD237=\"\",\"\",COUNTIF(AD:AD,AD237))","v":""},null,null,null,null,null,null,null,{"$f":"IF(OR(AE237=\"\",AH237=\"\",AI237=\"\"),\"\",IF(AH237=\"part time\",\"\",AI237-AH237))","v":""}]
[null,null,null,null,null,null,null,null,null,null,null,null,null,null,null,null,null,null,null,null,null,null,null,null,null,{"$f":"IF(AB238=\"\",\"Z\",AB238)","v":"Z"}," ",{"$f":"IF(ISERROR(VLOOKUP(AD238,$AV$14:$AW$87,2)),\"\",VLOOKUP(AD238,$AV$14:$AW$87,2))","v":""},{"$f":"IF(AD238=\"\",\"\",COUNTIF(AD:AD,AD238))","v":""},null,null,null,null,null,null,null,{"$f":"IF(OR(AE238=\"\",AH238=\"\",AI238=\"\"),\"\",IF(AH238=\"part time\",\"\",AI238-AH238))","v":""}]
[null,null,null,null,null,null,null,null,null,null,null,null,null,null,null,null,null,null,null,null,null,null,null,null,null,{"$f":"IF(AB239=\"\",\"Z\",AB239)","v":"Z"}," ",{"$f":"IF(ISERROR(VLOOKUP(AD239,$AV$14:$AW$87,2)),\"\",VLOOKUP(AD239,$AV$14:$AW$87,2))","v":""},{"$f":"IF(AD239=\"\",\"\",COUNTIF(AD:AD,AD239))","v":""},null,null,null,null,null,null,null,{"$f":"IF(OR(AE239=\"\",AH239=\"\",AI239=\"\"),\"\",IF(AH239=\"part time\",\"\",AI239-AH239))","v":""}]
[null,null,null,null,null,null,null,null,null,null,null,null,null,null,null,null,null,null,null,null,null,null,null,null,null,{"$f":"IF(AB240=\"\",\"Z\",AB240)","v":"Z"}," ",{"$f":"IF(ISERROR(VLOOKUP(AD240,$AV$14:$AW$87,2)),\"\",VLOOKUP(AD240,$AV$14:$AW$87,2))","v":""},{"$f":"IF(AD240=\"\",\"\",COUNTIF(AD:AD,AD240))","v":""},null,null,null,null,null,null,null,{"$f":"IF(OR(AE240=\"\",AH240=\"\",AI240=\"\"),\"\",IF(AH240=\"part time\",\"\",AI240-AH240))","v":""}]
[null,null,null,null,null,null,null,null,null,null,null,null,null,null,null,null,null,null,null,null,null,null,null,null,null,{"$f":"IF(AB241=\"\",\"Z\",AB241)","v":"Z"}," ",{"$f":"IF(ISERROR(VLOOKUP(AD241,$AV$14:$AW$87,2)),\"\",VLOOKUP(AD241,$AV$14:$AW$87,2))","v":""},{"$f":"IF(AD241=\"\",\"\",COUNTIF(AD:AD,AD241))","v":""},null,null,null,null,null,null,null,{"$f":"IF(OR(AE241=\"\",AH241=\"\",AI241=\"\"),\"\",IF(AH241=\"part time\",\"\",AI241-AH241))","v":""}]
[null,null,null,null,null,null,null,null,null,null,null,null,null,null,null,null,null,null,null,null,null,null,null,null,null,{"$f":"IF(AB242=\"\",\"Z\",AB242)","v":"Z"}," ",{"$f":"IF(ISERROR(VLOOKUP(AD242,$AV$14:$AW$87,2)),\"\",VLOOKUP(AD242,$AV$14:$AW$87,2))","v":""},{"$f":"IF(AD242=\"\",\"\",COUNTIF(AD:AD,AD242))","v":""},null,null,null,null,null,null,null,{"$f":"IF(OR(AE242=\"\",AH242=\"\",AI242=\"\"),\"\",IF(AH242=\"part time\",\"\",AI242-AH242))","v":""}]
[null,null,null,null,null,null,null,null,null,null,null,null,null,null,null,null,null,null,null,null,null,null,null,null,null,{"$f":"IF(AB243=\"\",\"Z\",AB243)","v":"Z"}," ",{"$f":"IF(ISERROR(VLOOKUP(AD243,$AV$14:$AW$87,2)),\"\",VLOOKUP(AD243,$AV$14:$AW$87,2))","v":""},{"$f":"IF(AD243=\"\",\"\",COUNTIF(AD:AD,AD243))","v":""},null,null,null,null,null,null,null,{"$f":"IF(OR(AE243=\"\",AH243=\"\",AI243=\"\"),\"\",IF(AH243=\"part time\",\"\",AI243-AH243))","v":""}]
[null,null,null,null,null,null,null,null,null,null,null,null,null,null,null,null,null,null,null,null,null,null,null,null,null,{"$f":"IF(AB244=\"\",\"Z\",AB244)","v":"Z"}," ",{"$f":"IF(ISERROR(VLOOKUP(AD244,$AV$14:$AW$87,2)),\"\",VLOOKUP(AD244,$AV$14:$AW$87,2))","v":""},{"$f":"IF(AD244=\"\",\"\",COUNTIF(AD:AD,AD244))","v":""},null,null,null,null,null,null,null,{"$f":"IF(OR(AE244=\"\",AH244=\"\",AI244=\"\"),\"\",IF(AH244=\"part time\",\"\",AI244-AH244))","v":""}]
[null,null,null,null,null,null,null,null,null,null,null,null,null,null,null,null,null,null,null,null,null,null,null,null,null,{"$f":"IF(AB245=\"\",\"Z\",AB245)","v":"Z"}," ",{"$f":"IF(ISERROR(VLOOKUP(AD245,$AV$14:$AW$87,2)),\"\",VLOOKUP(AD245,$AV$14:$AW$87,2))","v":""},{"$f":"IF(AD245=\"\",\"\",COUNTIF(AD:AD,AD245))","v":""},null,null,null,null,null,null,null,{"$f":"IF(OR(AE245=\"\",AH245=\"\",AI245=\"\"),\"\",IF(AH245=\"part time\",\"\",AI245-AH245))","v":""}]
[null,null,null,null,null,null,null,null,null,null,null,null,null,null,null,null,null,null,null,null,null,null,null,null,null,{"$f":"IF(AB246=\"\",\"Z\",AB246)","v":"Z"}," ",{"$f":"IF(ISERROR(VLOOKUP(AD246,$AV$14:$AW$87,2)),\"\",VLOOKUP(AD246,$AV$14:$AW$87,2))","v":""},{"$f":"IF(AD246=\"\",\"\",COUNTIF(AD:AD,AD246))","v":""},null,null,null,null,null,null,null,{"$f":"IF(OR(AE246=\"\",AH246=\"\",AI246=\"\"),\"\",IF(AH246=\"part time\",\"\",AI246-AH246))","v":""}]
[null,null,null,null,null,null,null,null,null,null,null,null,null,null,null,null,null,null,null,null,null,null,null,null,null,{"$f":"IF(AB247=\"\",\"Z\",AB247)","v":"Z"}," ",{"$f":"IF(ISERROR(VLOOKUP(AD247,$AV$14:$AW$87,2)),\"\",VLOOKUP(AD247,$AV$14:$AW$87,2))","v":""},{"$f":"IF(AD247=\"\",\"\",COUNTIF(AD:AD,AD247))","v":""},null,null,null,null,null,null,null,{"$f":"IF(OR(AE247=\"\",AH247=\"\",AI247=\"\"),\"\",IF(AH247=\"part time\",\"\",AI247-AH247))","v":""}]
[null,null,null,null,null,null,null,null,null,null,null,null,null,null,null,null,null,null,null,null,null,null,null,null,null,{"$f":"IF(AB248=\"\",\"Z\",AB248)","v":"Z"}," ",{"$f":"IF(ISERROR(VLOOKUP(AD248,$AV$14:$AW$87,2)),\"\",VLOOKUP(AD248,$AV$14:$AW$87,2))","v":""},{"$f":"IF(AD248=\"\",\"\",COUNTIF(AD:AD,AD248))","v":""},null,null,null,null,null,null,null,{"$f":"IF(OR(AE248=\"\",AH248=\"\",AI248=\"\"),\"\",IF(AH248=\"part time\",\"\",AI248-AH248))","v":""}]
[null,null,null,null,null,null,null,null,null,null,null,null,null,null,null,null,null,null,null,null,null,null,null,null,null,{"$f":"IF(AB249=\"\",\"Z\",AB249)","v":"Z"}," ",{"$f":"IF(ISERROR(VLOOKUP(AD249,$AV$14:$AW$87,2)),\"\",VLOOKUP(AD249,$AV$14:$AW$87,2))","v":""},{"$f":"IF(AD249=\"\",\"\",COUNTIF(AD:AD,AD249))","v":""},null,null,null,null,null,null,null,{"$f":"IF(OR(AE249=\"\",AH249=\"\",AI249=\"\"),\"\",IF(AH249=\"part time\",\"\",AI249-AH249))","v":""}]
[null,null,null,null,null,null,null,null,null,null,null,null,null,null,null,null,null,null,null,null,null,null,null,null,null,{"$f":"IF(AB250=\"\",\"Z\",AB250)","v":"Z"}," ",{"$f":"IF(ISERROR(VLOOKUP(AD250,$AV$14:$AW$87,2)),\"\",VLOOKUP(AD250,$AV$14:$AW$87,2))","v":""},{"$f":"IF(AD250=\"\",\"\",COUNTIF(AD:AD,AD250))","v":""},null,null,null,null,null,null,null,{"$f":"IF(OR(AE250=\"\",AH250=\"\",AI250=\"\"),\"\",IF(AH250=\"part time\",\"\",AI250-AH250))","v":""}]
[null,null,null,null,null,null,null,null,null,null,null,null,null,null,null,null,null,null,null,null,null,null,null,null,null,{"$f":"IF(AB251=\"\",\"Z\",AB251)","v":"Z"}," ",{"$f":"IF(ISERROR(VLOOKUP(AD251,$AV$14:$AW$87,2)),\"\",VLOOKUP(AD251,$AV$14:$AW$87,2))","v":""},{"$f":"IF(AD251=\"\",\"\",COUNTIF(AD:AD,AD251))","v":""},null,null,null,null,null,null,null,{"$f":"IF(OR(AE251=\"\",AH251=\"\",AI251=\"\"),\"\",IF(AH251=\"part time\",\"\",AI251-AH251))","v":""}]
[null,null,null,null,null,null,null,null,null,null,null,null,null,null,null,null,null,null,null,null,null,null,null,null,null,{"$f":"IF(AB252=\"\",\"Z\",AB252)","v":"Z"}," ",{"$f":"IF(ISERROR(VLOOKUP(AD252,$AV$14:$AW$87,2)),\"\",VLOOKUP(AD252,$AV$14:$AW$87,2))","v":""},{"$f":"IF(AD252=\"\",\"\",COUNTIF(AD:AD,AD252))","v":""},null,null,null,null,null,null,null,{"$f":"IF(OR(AE252=\"\",AH252=\"\",AI252=\"\"),\"\",IF(AH252=\"part time\",\"\",AI252-AH252))","v":""}]
[null,null,null,null,null,null,null,null,null,null,null,null,null,null,null,null,null,null,null,null,null,null,null,null,null,{"$f":"IF(AB253=\"\",\"Z\",AB253)","v":"Z"}," ",{"$f":"IF(ISERROR(VLOOKUP(AD253,$AV$14:$AW$87,2)),\"\",VLOOKUP(AD253,$AV$14:$AW$87,2))","v":""},{"$f":"IF(AD253=\"\",\"\",COUNTIF(AD:AD,AD253))","v":""},null,null,null,null,null,null,null,{"$f":"IF(OR(AE253=\"\",AH253=\"\",AI253=\"\"),\"\",IF(AH253=\"part time\",\"\",AI253-AH253))","v":""}]
[null,null,null,null,null,null,null,null,null,null,null,null,null,null,null,null,null,null,null,null,null,null,null,null,null,{"$f":"IF(AB254=\"\",\"Z\",AB254)","v":"Z"}," ",{"$f":"IF(ISERROR(VLOOKUP(AD254,$AV$14:$AW$87,2)),\"\",VLOOKUP(AD254,$AV$14:$AW$87,2))","v":""},{"$f":"IF(AD254=\"\",\"\",COUNTIF(AD:AD,AD254))","v":""},null,null,null,null,null,null,null,{"$f":"IF(OR(AE254=\"\",AH254=\"\",AI254=\"\"),\"\",IF(AH254=\"part time\",\"\",AI254-AH254))","v":""}]
[null,null,null,null,null,null,null,null,null,null,null,null,null,null,null,null,null,null,null,null,null,null,null,null,null,{"$f":"IF(AB255=\"\",\"Z\",AB255)","v":"Z"}," ",{"$f":"IF(ISERROR(VLOOKUP(AD255,$AV$14:$AW$87,2)),\"\",VLOOKUP(AD255,$AV$14:$AW$87,2))","v":""},{"$f":"IF(AD255=\"\",\"\",COUNTIF(AD:AD,AD255))","v":""},null,null,null,null,null,null,null,{"$f":"IF(OR(AE255=\"\",AH255=\"\",AI255=\"\"),\"\",IF(AH255=\"part time\",\"\",AI255-AH255))","v":""}]
[null,null,null,null,null,null,null,null,null,null,null,null,null,null,null,null,null,null,null,null,null,null,null,null,null,{"$f":"IF(AB256=\"\",\"Z\",AB256)","v":"Z"}," ",{"$f":"IF(ISERROR(VLOOKUP(AD256,$AV$14:$AW$87,2)),\"\",VLOOKUP(AD256,$AV$14:$AW$87,2))","v":""},{"$f":"IF(AD256=\"\",\"\",COUNTIF(AD:AD,AD256))","v":""},null,null,null,null,null,null,null,{"$f":"IF(OR(AE256=\"\",AH256=\"\",AI256=\"\"),\"\",IF(AH256=\"part time\",\"\",AI256-AH256))","v":""}]
[null,null,null,null,null,null,null,null,null,null,null,null,null,null,null,null,null,null,null,null,null,null,null,null,null,{"$f":"IF(AB257=\"\",\"Z\",AB257)","v":"Z"}," ",{"$f":"IF(ISERROR(VLOOKUP(AD257,$AV$14:$AW$87,2)),\"\",VLOOKUP(AD257,$AV$14:$AW$87,2))","v":""},{"$f":"IF(AD257=\"\",\"\",COUNTIF(AD:AD,AD257))","v":""},null,null,null,null,null,null,null,{"$f":"IF(OR(AE257=\"\",AH257=\"\",AI257=\"\"),\"\",IF(AH257=\"part time\",\"\",AI257-AH257))","v":""}]
[null,null,null,null,null,null,null,null,null,null,null,null,null,null,null,null,null,null,null,null,null,null,null,null,null,{"$f":"IF(AB258=\"\",\"Z\",AB258)","v":"Z"}," ",{"$f":"IF(ISERROR(VLOOKUP(AD258,$AV$14:$AW$87,2)),\"\",VLOOKUP(AD258,$AV$14:$AW$87,2))","v":""},{"$f":"IF(AD258=\"\",\"\",COUNTIF(AD:AD,AD258))","v":""},null,null,null,null,null,null,null,{"$f":"IF(OR(AE258=\"\",AH258=\"\",AI258=\"\"),\"\",IF(AH258=\"part time\",\"\",AI258-AH258))","v":""}]
[null,null,null,null,null,null,null,null,null,null,null,null,null,null,null,null,null,null,null,null,null,null,null,null,null,{"$f":"IF(AB259=\"\",\"Z\",AB259)","v":"Z"}," ",{"$f":"IF(ISERROR(VLOOKUP(AD259,$AV$14:$AW$87,2)),\"\",VLOOKUP(AD259,$AV$14:$AW$87,2))","v":""},{"$f":"IF(AD259=\"\",\"\",COUNTIF(AD:AD,AD259))","v":""},null,null,null,null,null,null,null,{"$f":"IF(OR(AE259=\"\",AH259=\"\",AI259=\"\"),\"\",IF(AH259=\"part time\",\"\",AI259-AH259))","v":""}]
[null,null,null,null,null,null,null,null,null,null,null,null,null,null,null,null,null,null,null,null,null,null,null,null,null,{"$f":"IF(AB260=\"\",\"Z\",AB260)","v":"Z"}," ",{"$f":"IF(ISERROR(VLOOKUP(AD260,$AV$14:$AW$87,2)),\"\",VLOOKUP(AD260,$AV$14:$AW$87,2))","v":""},{"$f":"IF(AD260=\"\",\"\",COUNTIF(AD:AD,AD260))","v":""},null,null,null,null,null,null,null,{"$f":"IF(OR(AE260=\"\",AH260=\"\",AI260=\"\"),\"\",IF(AH260=\"part time\",\"\",AI260-AH260))","v":""}]
[null,null,null,null,null,null,null,null,null,null,null,null,null,null,null,null,null,null,null,null,null,null,null,null,null,{"$f":"IF(AB261=\"\",\"Z\",AB261)","v":"Z"}," ",{"$f":"IF(ISERROR(VLOOKUP(AD261,$AV$14:$AW$87,2)),\"\",VLOOKUP(AD261,$AV$14:$AW$87,2))","v":""},{"$f":"IF(AD261=\"\",\"\",COUNTIF(AD:AD,AD261))","v":""},null,null,null,null,null,null,null,{"$f":"IF(OR(AE261=\"\",AH261=\"\",AI261=\"\"),\"\",IF(AH261=\"part time\",\"\",AI261-AH261))","v":""}]
[null,null,null,null,null,null,null,null,null,null,null,null,null,null,null,null,null,null,null,null,null,null,null,null,null,{"$f":"IF(AB262=\"\",\"Z\",AB262)","v":"Z"}," ",{"$f":"IF(ISERROR(VLOOKUP(AD262,$AV$14:$AW$87,2)),\"\",VLOOKUP(AD262,$AV$14:$AW$87,2))","v":""},{"$f":"IF(AD262=\"\",\"\",COUNTIF(AD:AD,AD262))","v":""},null,null,null,null,null,null,null,{"$f":"IF(OR(AE262=\"\",AH262=\"\",AI262=\"\"),\"\",IF(AH262=\"part time\",\"\",AI262-AH262))","v":""}]
[null,null,null,null,null,null,null,null,null,null,null,null,null,null,null,null,null,null,null,null,null,null,null,null,null,{"$f":"IF(AB263=\"\",\"Z\",AB263)","v":"Z"}," ",{"$f":"IF(ISERROR(VLOOKUP(AD263,$AV$14:$AW$87,2)),\"\",VLOOKUP(AD263,$AV$14:$AW$87,2))","v":""},{"$f":"IF(AD263=\"\",\"\",COUNTIF(AD:AD,AD263))","v":""},null,null,null,null,null,null,null,{"$f":"IF(OR(AE263=\"\",AH263=\"\",AI263=\"\"),\"\",IF(AH263=\"part time\",\"\",AI263-AH263))","v":""}]
[null,null,null,null,null,null,null,null,null,null,null,null,null,null,null,null,null,null,null,null,null,null,null,null,null,{"$f":"IF(AB264=\"\",\"Z\",AB264)","v":"Z"}," ",{"$f":"IF(ISERROR(VLOOKUP(AD264,$AV$14:$AW$87,2)),\"\",VLOOKUP(AD264,$AV$14:$AW$87,2))","v":""},{"$f":"IF(AD264=\"\",\"\",COUNTIF(AD:AD,AD264))","v":""},null,null,null,null,null,null,null,{"$f":"IF(OR(AE264=\"\",AH264=\"\",AI264=\"\"),\"\",IF(AH264=\"part time\",\"\",AI264-AH264))","v":""}]
[null,null,null,null,null,null,null,null,null,null,null,null,null,null,null,null,null,null,null,null,null,null,null,null,null,{"$f":"IF(AB265=\"\",\"Z\",AB265)","v":"Z"}," ",{"$f":"IF(ISERROR(VLOOKUP(AD265,$AV$14:$AW$87,2)),\"\",VLOOKUP(AD265,$AV$14:$AW$87,2))","v":""},{"$f":"IF(AD265=\"\",\"\",COUNTIF(AD:AD,AD265))","v":""},null,null,null,null,null,null,null,{"$f":"IF(OR(AE265=\"\",AH265=\"\",AI265=\"\"),\"\",IF(AH265=\"part time\",\"\",AI265-AH265))","v":""}]
[null,null,null,null,null,null,null,null,null,null,null,null,null,null,null,null,null,null,null,null,null,null,null,null,null,{"$f":"IF(AB266=\"\",\"Z\",AB266)","v":"Z"}," ",{"$f":"IF(ISERROR(VLOOKUP(AD266,$AV$14:$AW$87,2)),\"\",VLOOKUP(AD266,$AV$14:$AW$87,2))","v":""},{"$f":"IF(AD266=\"\",\"\",COUNTIF(AD:AD,AD266))","v":""},null,null,null,null,null,null,null,{"$f":"IF(OR(AE266=\"\",AH266=\"\",AI266=\"\"),\"\",IF(AH266=\"part time\",\"\",AI266-AH266))","v":""}]
[null,null,null,null,null,null,null,null,null,null,null,null,null,null,null,null,null,null,null,null,null,null,null,null,null,{"$f":"IF(AB267=\"\",\"Z\",AB267)","v":"Z"}," ",{"$f":"IF(ISERROR(VLOOKUP(AD267,$AV$14:$AW$87,2)),\"\",VLOOKUP(AD267,$AV$14:$AW$87,2))","v":""},{"$f":"IF(AD267=\"\",\"\",COUNTIF(AD:AD,AD267))","v":""},null,null,null,null,null,null,null,{"$f":"IF(OR(AE267=\"\",AH267=\"\",AI267=\"\"),\"\",IF(AH267=\"part time\",\"\",AI267-AH267))","v":""}]
[null,null,null,null,null,null,null,null,null,null,null,null,null,null,null,null,null,null,null,null,null,null,null,null,null,{"$f":"IF(AB268=\"\",\"Z\",AB268)","v":"Z"}," ",{"$f":"IF(ISERROR(VLOOKUP(AD268,$AV$14:$AW$87,2)),\"\",VLOOKUP(AD268,$AV$14:$AW$87,2))","v":""},{"$f":"IF(AD268=\"\",\"\",COUNTIF(AD:AD,AD268))","v":""},null,null,null,null,null,null,null,{"$f":"IF(OR(AE268=\"\",AH268=\"\",AI268=\"\"),\"\",IF(AH268=\"part time\",\"\",AI268-AH268))","v":""}]
[null,null,null,null,null,null,null,null,null,null,null,null,null,null,null,null,null,null,null,null,null,null,null,null,null,{"$f":"IF(AB269=\"\",\"Z\",AB269)","v":"Z"}," ",{"$f":"IF(ISERROR(VLOOKUP(AD269,$AV$14:$AW$87,2)),\"\",VLOOKUP(AD269,$AV$14:$AW$87,2))","v":""},{"$f":"IF(AD269=\"\",\"\",COUNTIF(AD:AD,AD269))","v":""},null,null,null,null,null,null,null,{"$f":"IF(OR(AE269=\"\",AH269=\"\",AI269=\"\"),\"\",IF(AH269=\"part time\",\"\",AI269-AH269))","v":""}]
[null,null,null,null,null,null,null,null,null,null,null,null,null,null,null,null,null,null,null,null,null,null,null,null,null,{"$f":"IF(AB270=\"\",\"Z\",AB270)","v":"Z"}," ",{"$f":"IF(ISERROR(VLOOKUP(AD270,$AV$14:$AW$87,2)),\"\",VLOOKUP(AD270,$AV$14:$AW$87,2))","v":""},{"$f":"IF(AD270=\"\",\"\",COUNTIF(AD:AD,AD270))","v":""},null,null,null,null,null,null,null,{"$f":"IF(OR(AE270=\"\",AH270=\"\",AI270=\"\"),\"\",IF(AH270=\"part time\",\"\",AI270-AH270))","v":""}]
[null,null,null,null,null,null,null,null,null,null,null,null,null,null,null,null,null,null,null,null,null,null,null,null,null,{"$f":"IF(AB271=\"\",\"Z\",AB271)","v":"Z"}," ",{"$f":"IF(ISERROR(VLOOKUP(AD271,$AV$14:$AW$87,2)),\"\",VLOOKUP(AD271,$AV$14:$AW$87,2))","v":""},{"$f":"IF(AD271=\"\",\"\",COUNTIF(AD:AD,AD271))","v":""},null,null,null,null,null,null,null,{"$f":"IF(OR(AE271=\"\",AH271=\"\",AI271=\"\"),\"\",IF(AH271=\"part time\",\"\",AI271-AH271))","v":""}]
[null,null,null,null,null,null,null,null,null,null,null,null,null,null,null,null,null,null,null,null,null,null,null,null,null,{"$f":"IF(AB272=\"\",\"Z\",AB272)","v":"Z"}," ",{"$f":"IF(ISERROR(VLOOKUP(AD272,$AV$14:$AW$87,2)),\"\",VLOOKUP(AD272,$AV$14:$AW$87,2))","v":""},{"$f":"IF(AD272=\"\",\"\",COUNTIF(AD:AD,AD272))","v":""},null,null,null,null,null,null,null,{"$f":"IF(OR(AE272=\"\",AH272=\"\",AI272=\"\"),\"\",IF(AH272=\"part time\",\"\",AI272-AH272))","v":""}]
[null,null,null,null,null,null,null,null,null,null,null,null,null,null,null,null,null,null,null,null,null,null,null,null,null,{"$f":"IF(AB273=\"\",\"Z\",AB273)","v":"Z"}," ",{"$f":"IF(ISERROR(VLOOKUP(AD273,$AV$14:$AW$87,2)),\"\",VLOOKUP(AD273,$AV$14:$AW$87,2))","v":""},{"$f":"IF(AD273=\"\",\"\",COUNTIF(AD:AD,AD273))","v":""},null,null,null,null,null,null,null,{"$f":"IF(OR(AE273=\"\",AH273=\"\",AI273=\"\"),\"\",IF(AH273=\"part time\",\"\",AI273-AH273))","v":""}]
[null,null,null,null,null,null,null,null,null,null,null,null,null,null,null,null,null,null,null,null,null,null,null,null,null,{"$f":"IF(AB274=\"\",\"Z\",AB274)","v":"Z"}," ",{"$f":"IF(ISERROR(VLOOKUP(AD274,$AV$14:$AW$87,2)),\"\",VLOOKUP(AD274,$AV$14:$AW$87,2))","v":""},{"$f":"IF(AD274=\"\",\"\",COUNTIF(AD:AD,AD274))","v":""},null,null,null,null,null,null,null,{"$f":"IF(OR(AE274=\"\",AH274=\"\",AI274=\"\"),\"\",IF(AH274=\"part time\",\"\",AI274-AH274))","v":""}]
[null,null,null,null,null,null,null,null,null,null,null,null,null,null,null,null,null,null,null,null,null,null,null,null,null,{"$f":"IF(AB275=\"\",\"Z\",AB275)","v":"Z"}," ",{"$f":"IF(ISERROR(VLOOKUP(AD275,$AV$14:$AW$87,2)),\"\",VLOOKUP(AD275,$AV$14:$AW$87,2))","v":""},{"$f":"IF(AD275=\"\",\"\",COUNTIF(AD:AD,AD275))","v":""},null,null,null,null,null,null,null,{"$f":"IF(OR(AE275=\"\",AH275=\"\",AI275=\"\"),\"\",IF(AH275=\"part time\",\"\",AI275-AH275))","v":""}]
[null,null,null,null,null,null,null,null,null,null,null,null,null,null,null,null,null,null,null,null,null,null,null,null,null,{"$f":"IF(AB276=\"\",\"Z\",AB276)","v":"Z"}," ",{"$f":"IF(ISERROR(VLOOKUP(AD276,$AV$14:$AW$87,2)),\"\",VLOOKUP(AD276,$AV$14:$AW$87,2))","v":""},{"$f":"IF(AD276=\"\",\"\",COUNTIF(AD:AD,AD276))","v":""},null,null,null,null,null,null,null,{"$f":"IF(OR(AE276=\"\",AH276=\"\",AI276=\"\"),\"\",IF(AH276=\"part time\",\"\",AI276-AH276))","v":""}]
[null,null,null,null,null,null,null,null,null,null,null,null,null,null,null,null,null,null,null,null,null,null,null,null,null,{"$f":"IF(AB277=\"\",\"Z\",AB277)","v":"Z"}," ",{"$f":"IF(ISERROR(VLOOKUP(AD277,$AV$14:$AW$87,2)),\"\",VLOOKUP(AD277,$AV$14:$AW$87,2))","v":""},{"$f":"IF(AD277=\"\",\"\",COUNTIF(AD:AD,AD277))","v":""},null,null,null,null,null,null,null,{"$f":"IF(OR(AE277=\"\",AH277=\"\",AI277=\"\"),\"\",IF(AH277=\"part time\",\"\",AI277-AH277))","v":""}]
[null,null,null,null,null,null,null,null,null,null,null,null,null,null,null,null,null,null,null,null,null,null,null,null,null,{"$f":"IF(AB278=\"\",\"Z\",AB278)","v":"Z"}," ",{"$f":"IF(ISERROR(VLOOKUP(AD278,$AV$14:$AW$87,2)),\"\",VLOOKUP(AD278,$AV$14:$AW$87,2))","v":""},{"$f":"IF(AD278=\"\",\"\",COUNTIF(AD:AD,AD278))","v":""},null,null,null,null,null,null,null,{"$f":"IF(OR(AE278=\"\",AH278=\"\",AI278=\"\"),\"\",IF(AH278=\"part time\",\"\",AI278-AH278))","v":""}]
[null,null,null,null,null,null,null,null,null,null,null,null,null,null,null,null,null,null,null,null,null,null,null,null,null,{"$f":"IF(AB279=\"\",\"Z\",AB279)","v":"Z"}," ",{"$f":"IF(ISERROR(VLOOKUP(AD279,$AV$14:$AW$87,2)),\"\",VLOOKUP(AD279,$AV$14:$AW$87,2))","v":""},{"$f":"IF(AD279=\"\",\"\",COUNTIF(AD:AD,AD279))","v":""},null,null,null,null,null,null,null,{"$f":"IF(OR(AE279=\"\",AH279=\"\",AI279=\"\"),\"\",IF(AH279=\"part time\",\"\",AI279-AH279))","v":""}]
[null,null,null,null,null,null,null,null,null,null,null,null,null,null,null,null,null,null,null,null,null,null,null,null,null,{"$f":"IF(AB280=\"\",\"Z\",AB280)","v":"Z"}," ",{"$f":"IF(ISERROR(VLOOKUP(AD280,$AV$14:$AW$87,2)),\"\",VLOOKUP(AD280,$AV$14:$AW$87,2))","v":""},{"$f":"IF(AD280=\"\",\"\",COUNTIF(AD:AD,AD280))","v":""},null,null,null,null,null,null,null,{"$f":"IF(OR(AE280=\"\",AH280=\"\",AI280=\"\"),\"\",IF(AH280=\"part time\",\"\",AI280-AH280))","v":""}]
[null,null,null,null,null,null,null,null,null,null,null,null,null,null,null,null,null,null,null,null,null,null,null,null,null,{"$f":"IF(AB281=\"\",\"Z\",AB281)","v":"Z"}," ",{"$f":"IF(ISERROR(VLOOKUP(AD281,$AV$14:$AW$87,2)),\"\",VLOOKUP(AD281,$AV$14:$AW$87,2))","v":""},{"$f":"IF(AD281=\"\",\"\",COUNTIF(AD:AD,AD281))","v":""},null,null,null,null,null,null,null,{"$f":"IF(OR(AE281=\"\",AH281=\"\",AI281=\"\"),\"\",IF(AH281=\"part time\",\"\",AI281-AH281))","v":""}]
[null,null,null,null,null,null,null,null,null,null,null,null,null,null,null,null,null,null,null,null,null,null,null,null,null,{"$f":"IF(AB282=\"\",\"Z\",AB282)","v":"Z"}," ",{"$f":"IF(ISERROR(VLOOKUP(AD282,$AV$14:$AW$87,2)),\"\",VLOOKUP(AD282,$AV$14:$AW$87,2))","v":""},{"$f":"IF(AD282=\"\",\"\",COUNTIF(AD:AD,AD282))","v":""},null,null,null,null,null,null,null,{"$f":"IF(OR(AE282=\"\",AH282=\"\",AI282=\"\"),\"\",IF(AH282=\"part time\",\"\",AI282-AH282))","v":""}]
[null,null,null,null,null,null,null,null,null,null,null,null,null,null,null,null,null,null,null,null,null,null,null,null,null,{"$f":"IF(AB283=\"\",\"Z\",AB283)","v":"Z"}," ",{"$f":"IF(ISERROR(VLOOKUP(AD283,$AV$14:$AW$87,2)),\"\",VLOOKUP(AD283,$AV$14:$AW$87,2))","v":""},{"$f":"IF(AD283=\"\",\"\",COUNTIF(AD:AD,AD283))","v":""},null,null,null,null,null,null,null,{"$f":"IF(OR(AE283=\"\",AH283=\"\",AI283=\"\"),\"\",IF(AH283=\"part time\",\"\",AI283-AH283))","v":""}]
[null,null,null,null,null,null,null,null,null,null,null,null,null,null,null,null,null,null,null,null,null,null,null,null,null,{"$f":"IF(AB284=\"\",\"Z\",AB284)","v":"Z"}," ",{"$f":"IF(ISERROR(VLOOKUP(AD284,$AV$14:$AW$87,2)),\"\",VLOOKUP(AD284,$AV$14:$AW$87,2))","v":""},{"$f":"IF(AD284=\"\",\"\",COUNTIF(AD:AD,AD284))","v":""},null,null,null,null,null,null,null,{"$f":"IF(OR(AE284=\"\",AH284=\"\",AI284=\"\"),\"\",IF(AH284=\"part time\",\"\",AI284-AH284))","v":""}]
[null,null,null,null,null,null,null,null,null,null,null,null,null,null,null,null,null,null,null,null,null,null,null,null,null,{"$f":"IF(AB285=\"\",\"Z\",AB285)","v":"Z"}," ",{"$f":"IF(ISERROR(VLOOKUP(AD285,$AV$14:$AW$87,2)),\"\",VLOOKUP(AD285,$AV$14:$AW$87,2))","v":""},{"$f":"IF(AD285=\"\",\"\",COUNTIF(AD:AD,AD285))","v":""},null,null,null,null,null,null,null,{"$f":"IF(OR(AE285=\"\",AH285=\"\",AI285=\"\"),\"\",IF(AH285=\"part time\",\"\",AI285-AH285))","v":""}]
[null,null,null,null,null,null,null,null,null,null,null,null,null,null,null,null,null,null,null,null,null,null,null,null,null,{"$f":"IF(AB286=\"\",\"Z\",AB286)","v":"Z"}," ",{"$f":"IF(ISERROR(VLOOKUP(AD286,$AV$14:$AW$87,2)),\"\",VLOOKUP(AD286,$AV$14:$AW$87,2))","v":""},{"$f":"IF(AD286=\"\",\"\",COUNTIF(AD:AD,AD286))","v":""},null,null,null,null,null,null,null,{"$f":"IF(OR(AE286=\"\",AH286=\"\",AI286=\"\"),\"\",IF(AH286=\"part time\",\"\",AI286-AH286))","v":""}]
[null,null,null,null,null,null,null,null,null,null,null,null,null,null,null,null,null,null,null,null,null,null,null,null,null,{"$f":"IF(AB287=\"\",\"Z\",AB287)","v":"Z"}," ",{"$f":"IF(ISERROR(VLOOKUP(AD287,$AV$14:$AW$87,2)),\"\",VLOOKUP(AD287,$AV$14:$AW$87,2))","v":""},{"$f":"IF(AD287=\"\",\"\",COUNTIF(AD:AD,AD287))","v":""},null,null,null,null,null,null,null,{"$f":"IF(OR(AE287=\"\",AH287=\"\",AI287=\"\"),\"\",IF(AH287=\"part time\",\"\",AI287-AH287))","v":""}]
[null,null,null,null,null,null,null,null,null,null,null,null,null,null,null,null,null,null,null,null,null,null,null,null,null,{"$f":"IF(AB288=\"\",\"Z\",AB288)","v":"Z"}," ",{"$f":"IF(ISERROR(VLOOKUP(AD288,$AV$14:$AW$87,2)),\"\",VLOOKUP(AD288,$AV$14:$AW$87,2))","v":""},{"$f":"IF(AD288=\"\",\"\",COUNTIF(AD:AD,AD288))","v":""},null,null,null,null,null,null,null,{"$f":"IF(OR(AE288=\"\",AH288=\"\",AI288=\"\"),\"\",IF(AH288=\"part time\",\"\",AI288-AH288))","v":""}]
[null,null,null,null,null,null,null,null,null,null,null,null,null,null,null,null,null,null,null,null,null,null,null,null,null,{"$f":"IF(AB289=\"\",\"Z\",AB289)","v":"Z"}," ",{"$f":"IF(ISERROR(VLOOKUP(AD289,$AV$14:$AW$87,2)),\"\",VLOOKUP(AD289,$AV$14:$AW$87,2))","v":""},{"$f":"IF(AD289=\"\",\"\",COUNTIF(AD:AD,AD289))","v":""},null,null,null,null,null,null,null,{"$f":"IF(OR(AE289=\"\",AH289=\"\",AI289=\"\"),\"\",IF(AH289=\"part time\",\"\",AI289-AH289))","v":""}]
[null,null,null,null,null,null,null,null,null,null,null,null,null,null,null,null,null,null,null,null,null,null,null,null,null,{"$f":"IF(AB290=\"\",\"Z\",AB290)","v":"Z"}," ",{"$f":"IF(ISERROR(VLOOKUP(AD290,$AV$14:$AW$87,2)),\"\",VLOOKUP(AD290,$AV$14:$AW$87,2))","v":""},{"$f":"IF(AD290=\"\",\"\",COUNTIF(AD:AD,AD290))","v":""},null,null,null,null,null,null,null,{"$f":"IF(OR(AE290=\"\",AH290=\"\",AI290=\"\"),\"\",IF(AH290=\"part time\",\"\",AI290-AH290))","v":""}]
[null,null,null,null,null,null,null,null,null,null,null,null,null,null,null,null,null,null,null,null,null,null,null,null,null,{"$f":"IF(AB291=\"\",\"Z\",AB291)","v":"Z"}," ",{"$f":"IF(ISERROR(VLOOKUP(AD291,$AV$14:$AW$87,2)),\"\",VLOOKUP(AD291,$AV$14:$AW$87,2))","v":""},{"$f":"IF(AD291=\"\",\"\",COUNTIF(AD:AD,AD291))","v":""},null,null,null,null,null,null,null,{"$f":"IF(OR(AE291=\"\",AH291=\"\",AI291=\"\"),\"\",IF(AH291=\"part time\",\"\",AI291-AH291))","v":""}]
[null,null,null,null,null,null,null,null,null,null,null,null,null,null,null,null,null,null,null,null,null,null,null,null,null,{"$f":"IF(AB292=\"\",\"Z\",AB292)","v":"Z"}," ",{"$f":"IF(ISERROR(VLOOKUP(AD292,$AV$14:$AW$87,2)),\"\",VLOOKUP(AD292,$AV$14:$AW$87,2))","v":""},{"$f":"IF(AD292=\"\",\"\",COUNTIF(AD:AD,AD292))","v":""},null,null,null,null,null,null,null,{"$f":"IF(OR(AE292=\"\",AH292=\"\",AI292=\"\"),\"\",IF(AH292=\"part time\",\"\",AI292-AH292))","v":""}]
[null,null,null,null,null,null,null,null,null,null,null,null,null,null,null,null,null,null,null,null,null,null,null,null,null,{"$f":"IF(AB293=\"\",\"Z\",AB293)","v":"Z"}," ",{"$f":"IF(ISERROR(VLOOKUP(AD293,$AV$14:$AW$87,2)),\"\",VLOOKUP(AD293,$AV$14:$AW$87,2))","v":""},{"$f":"IF(AD293=\"\",\"\",COUNTIF(AD:AD,AD293))","v":""},null,null,null,null,null,null,null,{"$f":"IF(OR(AE293=\"\",AH293=\"\",AI293=\"\"),\"\",IF(AH293=\"part time\",\"\",AI293-AH293))","v":""}]
[null,null,null,null,null,null,null,null,null,null,null,null,null,null,null,null,null,null,null,null,null,null,null,null,null,{"$f":"IF(AB294=\"\",\"Z\",AB294)","v":"Z"}," ",{"$f":"IF(ISERROR(VLOOKUP(AD294,$AV$14:$AW$87,2)),\"\",VLOOKUP(AD294,$AV$14:$AW$87,2))","v":""},{"$f":"IF(AD294=\"\",\"\",COUNTIF(AD:AD,AD294))","v":""},null,null,null,null,null,null,null,{"$f":"IF(OR(AE294=\"\",AH294=\"\",AI294=\"\"),\"\",IF(AH294=\"part time\",\"\",AI294-AH294))","v":""}]
[null,null,null,null,null,null,null,null,null,null,null,null,null,null,null,null,null,null,null,null,null,null,null,null,null,{"$f":"IF(AB295=\"\",\"Z\",AB295)","v":"Z"}," ",{"$f":"IF(ISERROR(VLOOKUP(AD295,$AV$14:$AW$87,2)),\"\",VLOOKUP(AD295,$AV$14:$AW$87,2))","v":""},{"$f":"IF(AD295=\"\",\"\",COUNTIF(AD:AD,AD295))","v":""},null,null,null,null,null,null,null,{"$f":"IF(OR(AE295=\"\",AH295=\"\",AI295=\"\"),\"\",IF(AH295=\"part time\",\"\",AI295-AH295))","v":""}]
[null,null,null,null,null,null,null,null,null,null,null,null,null,null,null,null,null,null,null,null,null,null,null,null,null,{"$f":"IF(AB296=\"\",\"Z\",AB296)","v":"Z"}," ",{"$f":"IF(ISERROR(VLOOKUP(AD296,$AV$14:$AW$87,2)),\"\",VLOOKUP(AD296,$AV$14:$AW$87,2))","v":""},{"$f":"IF(AD296=\"\",\"\",COUNTIF(AD:AD,AD296))","v":""},null,null,null,null,null,null,null,{"$f":"IF(OR(AE296=\"\",AH296=\"\",AI296=\"\"),\"\",IF(AH296=\"part time\",\"\",AI296-AH296))","v":""}]
[null,null,null,null,null,null,null,null,null,null,null,null,null,null,null,null,null,null,null,null,null,null,null,null,null,{"$f":"IF(AB297=\"\",\"Z\",AB297)","v":"Z"}," ",{"$f":"IF(ISERROR(VLOOKUP(AD297,$AV$14:$AW$87,2)),\"\",VLOOKUP(AD297,$AV$14:$AW$87,2))","v":""},{"$f":"IF(AD297=\"\",\"\",COUNTIF(AD:AD,AD297))","v":""},null,null,null,null,null,null,null,{"$f":"IF(OR(AE297=\"\",AH297=\"\",AI297=\"\"),\"\",IF(AH297=\"part time\",\"\",AI297-AH297))","v":""}]
[null,null,null,null,null,null,null,null,null,null,null,null,null,null,null,null,null,null,null,null,null,null,null,null,null,{"$f":"IF(AB298=\"\",\"Z\",AB298)","v":"Z"}," ",{"$f":"IF(ISERROR(VLOOKUP(AD298,$AV$14:$AW$87,2)),\"\",VLOOKUP(AD298,$AV$14:$AW$87,2))","v":""},{"$f":"IF(AD298=\"\",\"\",COUNTIF(AD:AD,AD298))","v":""},null,null,null,null,null,null,null,{"$f":"IF(OR(AE298=\"\",AH298=\"\",AI298=\"\"),\"\",IF(AH298=\"part time\",\"\",AI298-AH298))","v":""}]
[null,null,null,null,null,null,null,null,null,null,null,null,null,null,null,null,null,null,null,null,null,null,null,null,null,{"$f":"IF(AB299=\"\",\"Z\",AB299)","v":"Z"}," ",{"$f":"IF(ISERROR(VLOOKUP(AD299,$AV$14:$AW$87,2)),\"\",VLOOKUP(AD299,$AV$14:$AW$87,2))","v":""},{"$f":"IF(AD299=\"\",\"\",COUNTIF(AD:AD,AD299))","v":""},null,null,null,null,null,null,null,{"$f":"IF(OR(AE299=\"\",AH299=\"\",AI299=\"\"),\"\",IF(AH299=\"part time\",\"\",AI299-AH299))","v":""}]
[null,null,null,null,null,null,null,null,null,null,null,null,null,null,null,null,null,null,null,null,null,null,null,null,null,{"$f":"IF(AB300=\"\",\"Z\",AB300)","v":"Z"}," ",{"$f":"IF(ISERROR(VLOOKUP(AD300,$AV$14:$AW$87,2)),\"\",VLOOKUP(AD300,$AV$14:$AW$87,2))","v":""},{"$f":"IF(AD300=\"\",\"\",COUNTIF(AD:AD,AD300))","v":""},null,null,null,null,null,null,null,{"$f":"IF(OR(AE300=\"\",AH300=\"\",AI300=\"\"),\"\",IF(AH300=\"part time\",\"\",AI300-AH300))","v":""}]
[null,null,null,null,null,null,null,null,null,null,null,null,null,null,null,null,null,null,null,null,null,null,null,null,null,{"$f":"IF(AB301=\"\",\"Z\",AB301)","v":"Z"}," ",{"$f":"IF(ISERROR(VLOOKUP(AD301,$AV$14:$AW$87,2)),\"\",VLOOKUP(AD301,$AV$14:$AW$87,2))","v":""},{"$f":"IF(AD301=\"\",\"\",COUNTIF(AD:AD,AD301))","v":""},null,null,null,null,null,null,null,{"$f":"IF(OR(AE301=\"\",AH301=\"\",AI301=\"\"),\"\",IF(AH301=\"part time\",\"\",AI301-AH301))","v":""}]
[null,null,null,null,null,null,null,null,null,null,null,null,null,null,null,null,null,null,null,null,null,null,null,null,null,{"$f":"IF(AB302=\"\",\"Z\",AB302)","v":"Z"}," ",{"$f":"IF(ISERROR(VLOOKUP(AD302,$AV$14:$AW$87,2)),\"\",VLOOKUP(AD302,$AV$14:$AW$87,2))","v":""},{"$f":"IF(AD302=\"\",\"\",COUNTIF(AD:AD,AD302))","v":""},null,null,null,null,null,null,null,{"$f":"IF(OR(AE302=\"\",AH302=\"\",AI302=\"\"),\"\",IF(AH302=\"part time\",\"\",AI302-AH302))","v":""}]
[null,null,null,null,null,null,null,null,null,null,null,null,null,null,null,null,null,null,null,null,null,null,null,null,null,{"$f":"IF(AB303=\"\",\"Z\",AB303)","v":"Z"}," ",{"$f":"IF(ISERROR(VLOOKUP(AD303,$AV$14:$AW$87,2)),\"\",VLOOKUP(AD303,$AV$14:$AW$87,2))","v":""},{"$f":"IF(AD303=\"\",\"\",COUNTIF(AD:AD,AD303))","v":""},null,null,null,null,null,null,null,{"$f":"IF(OR(AE303=\"\",AH303=\"\",AI303=\"\"),\"\",IF(AH303=\"part time\",\"\",AI303-AH303))","v":""}]
[null,null,null,null,null,null,null,null,null,null,null,null,null,null,null,null,null,null,null,null,null,null,null,null,null,{"$f":"IF(AB304=\"\",\"Z\",AB304)","v":"Z"}," ",{"$f":"IF(ISERROR(VLOOKUP(AD304,$AV$14:$AW$87,2)),\"\",VLOOKUP(AD304,$AV$14:$AW$87,2))","v":""},{"$f":"IF(AD304=\"\",\"\",COUNTIF(AD:AD,AD304))","v":""},null,null,null,null,null,null,null,{"$f":"IF(OR(AE304=\"\",AH304=\"\",AI304=\"\"),\"\",IF(AH304=\"part time\",\"\",AI304-AH304))","v":""}]
[null,null,null,null,null,null,null,null,null,null,null,null,null,null,null,null,null,null,null,null,null,null,null,null,null,{"$f":"IF(AB305=\"\",\"Z\",AB305)","v":"Z"}," ",{"$f":"IF(ISERROR(VLOOKUP(AD305,$AV$14:$AW$87,2)),\"\",VLOOKUP(AD305,$AV$14:$AW$87,2))","v":""},{"$f":"IF(AD305=\"\",\"\",COUNTIF(AD:AD,AD305))","v":""},null,null,null,null,null,null,null,{"$f":"IF(OR(AE305=\"\",AH305=\"\",AI305=\"\"),\"\",IF(AH305=\"part time\",\"\",AI305-AH305))","v":""}]
[null,null,null,null,null,null,null,null,null,null,null,null,null,null,null,null,null,null,null,null,null,null,null,null,null,{"$f":"IF(AB306=\"\",\"Z\",AB306)","v":"Z"}," ",{"$f":"IF(ISERROR(VLOOKUP(AD306,$AV$14:$AW$87,2)),\"\",VLOOKUP(AD306,$AV$14:$AW$87,2))","v":""},{"$f":"IF(AD306=\"\",\"\",COUNTIF(AD:AD,AD306))","v":""},null,null,null,null,null,null,null,{"$f":"IF(OR(AE306=\"\",AH306=\"\",AI306=\"\"),\"\",IF(AH306=\"part time\",\"\",AI306-AH306))","v":""}]
[null,null,null,null,null,null,null,null,null,null,null,null,null,null,null,null,null,null,null,null,null,null,null,null,null,{"$f":"IF(AB307=\"\",\"Z\",AB307)","v":"Z"}," ",{"$f":"IF(ISERROR(VLOOKUP(AD307,$AV$14:$AW$87,2)),\"\",VLOOKUP(AD307,$AV$14:$AW$87,2))","v":""},{"$f":"IF(AD307=\"\",\"\",COUNTIF(AD:AD,AD307))","v":""},null,null,null,null,null,null,null,{"$f":"IF(OR(AE307=\"\",AH307=\"\",AI307=\"\"),\"\",IF(AH307=\"part time\",\"\",AI307-AH307))","v":""}]
[null,null,null,null,null,null,null,null,null,null,null,null,null,null,null,null,null,null,null,null,null,null,null,null,null,{"$f":"IF(AB308=\"\",\"Z\",AB308)","v":"Z"}," ",{"$f":"IF(ISERROR(VLOOKUP(AD308,$AV$14:$AW$87,2)),\"\",VLOOKUP(AD308,$AV$14:$AW$87,2))","v":""},{"$f":"IF(AD308=\"\",\"\",COUNTIF(AD:AD,AD308))","v":""},null,null,null,null,null,null,null,{"$f":"IF(OR(AE308=\"\",AH308=\"\",AI308=\"\"),\"\",IF(AH308=\"part time\",\"\",AI308-AH308))","v":""}]
[null,null,null,null,null,null,null,null,null,null,null,null,null,null,null,null,null,null,null,null,null,null,null,null,null,{"$f":"IF(AB309=\"\",\"Z\",AB309)","v":"Z"}," ",{"$f":"IF(ISERROR(VLOOKUP(AD309,$AV$14:$AW$87,2)),\"\",VLOOKUP(AD309,$AV$14:$AW$87,2))","v":""},{"$f":"IF(AD309=\"\",\"\",COUNTIF(AD:AD,AD309))","v":""},null,null,null,null,null,null,null,{"$f":"IF(OR(AE309=\"\",AH309=\"\",AI309=\"\"),\"\",IF(AH309=\"part time\",\"\",AI309-AH309))","v":""}]
[null,null,null,null,null,null,null,null,null,null,null,null,null,null,null,null,null,null,null,null,null,null,null,null,null,{"$f":"IF(AB310=\"\",\"Z\",AB310)","v":"Z"}," ",{"$f":"IF(ISERROR(VLOOKUP(AD310,$AV$14:$AW$87,2)),\"\",VLOOKUP(AD310,$AV$14:$AW$87,2))","v":""},{"$f":"IF(AD310=\"\",\"\",COUNTIF(AD:AD,AD310))","v":""},null,null,null,null,null,null,null,{"$f":"IF(OR(AE310=\"\",AH310=\"\",AI310=\"\"),\"\",IF(AH310=\"part time\",\"\",AI310-AH310))","v":""}]
[null,null,null,null,null,null,null,null,null,null,null,null,null,null,null,null,null,null,null,null,null,null,null,null,null,{"$f":"IF(AB311=\"\",\"Z\",AB311)","v":"Z"}," ",{"$f":"IF(ISERROR(VLOOKUP(AD311,$AV$14:$AW$87,2)),\"\",VLOOKUP(AD311,$AV$14:$AW$87,2))","v":""},{"$f":"IF(AD311=\"\",\"\",COUNTIF(AD:AD,AD311))","v":""},null,null,null,null,null,null,null,{"$f":"IF(OR(AE311=\"\",AH311=\"\",AI311=\"\"),\"\",IF(AH311=\"part time\",\"\",AI311-AH311))","v":""}]
[null,null,null,null,null,null,null,null,null,null,null,null,null,null,null,null,null,null,null,null,null,null,null,null,null,{"$f":"IF(AB312=\"\",\"Z\",AB312)","v":"Z"}," ",{"$f":"IF(ISERROR(VLOOKUP(AD312,$AV$14:$AW$87,2)),\"\",VLOOKUP(AD312,$AV$14:$AW$87,2))","v":""},{"$f":"IF(AD312=\"\",\"\",COUNTIF(AD:AD,AD312))","v":""},null,null,null,null,null,null,null,{"$f":"IF(OR(AE312=\"\",AH312=\"\",AI312=\"\"),\"\",IF(AH312=\"part time\",\"\",AI312-AH312))","v":""}]
[null,null,null,null,null,null,null,null,null,null,null,null,null,null,null,null,null,null,null,null,null,null,null,null,null,{"$f":"IF(AB313=\"\",\"Z\",AB313)","v":"Z"}," ",{"$f":"IF(ISERROR(VLOOKUP(AD313,$AV$14:$AW$87,2)),\"\",VLOOKUP(AD313,$AV$14:$AW$87,2))","v":""},{"$f":"IF(AD313=\"\",\"\",COUNTIF(AD:AD,AD313))","v":""},null,null,null,null,null,null,null,{"$f":"IF(OR(AE313=\"\",AH313=\"\",AI313=\"\"),\"\",IF(AH313=\"part time\",\"\",AI313-AH313))","v":""}]
[null,null,null,null,null,null,null,null,null,null,null,null,null,null,null,null,null,null,null,null,null,null,null,null,null,{"$f":"IF(AB314=\"\",\"Z\",AB314)","v":"Z"}," ",{"$f":"IF(ISERROR(VLOOKUP(AD314,$AV$14:$AW$87,2)),\"\",VLOOKUP(AD314,$AV$14:$AW$87,2))","v":""},{"$f":"IF(AD314=\"\",\"\",COUNTIF(AD:AD,AD314))","v":""},null,null,null,null,null,null,null,{"$f":"IF(OR(AE314=\"\",AH314=\"\",AI314=\"\"),\"\",IF(AH314=\"part time\",\"\",AI314-AH314))","v":""}]
[null,null,null,null,null,null,null,null,null,null,null,null,null,null,null,null,null,null,null,null,null,null,null,null,null,{"$f":"IF(AB315=\"\",\"Z\",AB315)","v":"Z"}," ",{"$f":"IF(ISERROR(VLOOKUP(AD315,$AV$14:$AW$87,2)),\"\",VLOOKUP(AD315,$AV$14:$AW$87,2))","v":""},{"$f":"IF(AD315=\"\",\"\",COUNTIF(AD:AD,AD315))","v":""},null,null,null,null,null,null,null,{"$f":"IF(OR(AE315=\"\",AH315=\"\",AI315=\"\"),\"\",IF(AH315=\"part time\",\"\",AI315-AH315))","v":""}]
[null,null,null,null,null,null,null,null,null,null,null,null,null,null,null,null,null,null,null,null,null,null,null,null,null,{"$f":"IF(AB316=\"\",\"Z\",AB316)","v":"Z"}," ",{"$f":"IF(ISERROR(VLOOKUP(AD316,$AV$14:$AW$87,2)),\"\",VLOOKUP(AD316,$AV$14:$AW$87,2))","v":""},{"$f":"IF(AD316=\"\",\"\",COUNTIF(AD:AD,AD316))","v":""},null,null,null,null,null,null,null,{"$f":"IF(OR(AE316=\"\",AH316=\"\",AI316=\"\"),\"\",IF(AH316=\"part time\",\"\",AI316-AH316))","v":""}]
[null,null,null,null,null,null,null,null,null,null,null,null,null,null,null,null,null,null,null,null,null,null,null,null,null,{"$f":"IF(AB317=\"\",\"Z\",AB317)","v":"Z"}," ",{"$f":"IF(ISERROR(VLOOKUP(AD317,$AV$14:$AW$87,2)),\"\",VLOOKUP(AD317,$AV$14:$AW$87,2))","v":""},{"$f":"IF(AD317=\"\",\"\",COUNTIF(AD:AD,AD317))","v":""},null,null,null,null,null,null,null,{"$f":"IF(OR(AE317=\"\",AH317=\"\",AI317=\"\"),\"\",IF(AH317=\"part time\",\"\",AI317-AH317))","v":""}]
[null,null,null,null,null,null,null,null,null,null,null,null,null,null,null,null,null,null,null,null,null,null,null,null,null,{"$f":"IF(AB318=\"\",\"Z\",AB318)","v":"Z"}," ",{"$f":"IF(ISERROR(VLOOKUP(AD318,$AV$14:$AW$87,2)),\"\",VLOOKUP(AD318,$AV$14:$AW$87,2))","v":""},{"$f":"IF(AD318=\"\",\"\",COUNTIF(AD:AD,AD318))","v":""},null,null,null,null,null,null,null,{"$f":"IF(OR(AE318=\"\",AH318=\"\",AI318=\"\"),\"\",IF(AH318=\"part time\",\"\",AI318-AH318))","v":""}]
[null,null,null,null,null,null,null,null,null,null,null,null,null,null,null,null,null,null,null,null,null,null,null,null,null,{"$f":"IF(AB319=\"\",\"Z\",AB319)","v":"Z"}," ",{"$f":"IF(ISERROR(VLOOKUP(AD319,$AV$14:$AW$87,2)),\"\",VLOOKUP(AD319,$AV$14:$AW$87,2))","v":""},{"$f":"IF(AD319=\"\",\"\",COUNTIF(AD:AD,AD319))","v":""},null,null,null,null,null,null,null,{"$f":"IF(OR(AE319=\"\",AH319=\"\",AI319=\"\"),\"\",IF(AH319=\"part time\",\"\",AI319-AH319))","v":""}]
[null,null,null,null,null,null,null,null,null,null,null,null,null,null,null,null,null,null,null,null,null,null,null,null,null,{"$f":"IF(AB320=\"\",\"Z\",AB320)","v":"Z"}," ",{"$f":"IF(ISERROR(VLOOKUP(AD320,$AV$14:$AW$87,2)),\"\",VLOOKUP(AD320,$AV$14:$AW$87,2))","v":""},{"$f":"IF(AD320=\"\",\"\",COUNTIF(AD:AD,AD320))","v":""},null,null,null,null,null,null,null,{"$f":"IF(OR(AE320=\"\",AH320=\"\",AI320=\"\"),\"\",IF(AH320=\"part time\",\"\",AI320-AH320))","v":""}]
[null,null,null,null,null,null,null,null,null,null,null,null,null,null,null,null,null,null,null,null,null,null,null,null,null,{"$f":"IF(AB321=\"\",\"Z\",AB321)","v":"Z"}," ",{"$f":"IF(ISERROR(VLOOKUP(AD321,$AV$14:$AW$87,2)),\"\",VLOOKUP(AD321,$AV$14:$AW$87,2))","v":""},{"$f":"IF(AD321=\"\",\"\",COUNTIF(AD:AD,AD321))","v":""},null,null,null,null,null,null,null,{"$f":"IF(OR(AE321=\"\",AH321=\"\",AI321=\"\"),\"\",IF(AH321=\"part time\",\"\",AI321-AH321))","v":""}]
[null,null,null,null,null,null,null,null,null,null,null,null,null,null,null,null,null,null,null,null,null,null,null,null,null,{"$f":"IF(AB322=\"\",\"Z\",AB322)","v":"Z"}," ",{"$f":"IF(ISERROR(VLOOKUP(AD322,$AV$14:$AW$87,2)),\"\",VLOOKUP(AD322,$AV$14:$AW$87,2))","v":""},{"$f":"IF(AD322=\"\",\"\",COUNTIF(AD:AD,AD322))","v":""},null,null,null,null,null,null,null,{"$f":"IF(OR(AE322=\"\",AH322=\"\",AI322=\"\"),\"\",IF(AH322=\"part time\",\"\",AI322-AH322))","v":""}]
[null,null,null,null,null,null,null,null,null,null,null,null,null,null,null,null,null,null,null,null,null,null,null,null,null,{"$f":"IF(AB323=\"\",\"Z\",AB323)","v":"Z"}," ",{"$f":"IF(ISERROR(VLOOKUP(AD323,$AV$14:$AW$87,2)),\"\",VLOOKUP(AD323,$AV$14:$AW$87,2))","v":""},{"$f":"IF(AD323=\"\",\"\",COUNTIF(AD:AD,AD323))","v":""},null,null,null,null,null,null,null,{"$f":"IF(OR(AE323=\"\",AH323=\"\",AI323=\"\"),\"\",IF(AH323=\"part time\",\"\",AI323-AH323))","v":""}]
[null,null,null,null,null,null,null,null,null,null,null,null,null,null,null,null,null,null,null,null,null,null,null,null,null,{"$f":"IF(AB324=\"\",\"Z\",AB324)","v":"Z"}," ",{"$f":"IF(ISERROR(VLOOKUP(AD324,$AV$14:$AW$87,2)),\"\",VLOOKUP(AD324,$AV$14:$AW$87,2))","v":""},{"$f":"IF(AD324=\"\",\"\",COUNTIF(AD:AD,AD324))","v":""},null,null,null,null,null,null,null,{"$f":"IF(OR(AE324=\"\",AH324=\"\",AI324=\"\"),\"\",IF(AH324=\"part time\",\"\",AI324-AH324))","v":""}]
[null,null,null,null,null,null,null,null,null,null,null,null,null,null,null,null,null,null,null,null,null,null,null,null,null,{"$f":"IF(AB325=\"\",\"Z\",AB325)","v":"Z"}," ",{"$f":"IF(ISERROR(VLOOKUP(AD325,$AV$14:$AW$87,2)),\"\",VLOOKUP(AD325,$AV$14:$AW$87,2))","v":""},{"$f":"IF(AD325=\"\",\"\",COUNTIF(AD:AD,AD325))","v":""},null,null,null,null,null,null,null,{"$f":"IF(OR(AE325=\"\",AH325=\"\",AI325=\"\"),\"\",IF(AH325=\"part time\",\"\",AI325-AH325))","v":""}]
[null,null,null,null,null,null,null,null,null,null,null,null,null,null,null,null,null,null,null,null,null,null,null,null,null,{"$f":"IF(AB326=\"\",\"Z\",AB326)","v":"Z"}," ",{"$f":"IF(ISERROR(VLOOKUP(AD326,$AV$14:$AW$87,2)),\"\",VLOOKUP(AD326,$AV$14:$AW$87,2))","v":""},{"$f":"IF(AD326=\"\",\"\",COUNTIF(AD:AD,AD326))","v":""},null,null,null,null,null,null,null,{"$f":"IF(OR(AE326=\"\",AH326=\"\",AI326=\"\"),\"\",IF(AH326=\"part time\",\"\",AI326-AH326))","v":""}]
[null,null,null,null,null,null,null,null,null,null,null,null,null,null,null,null,null,null,null,null,null,null,null,null,null,{"$f":"IF(AB327=\"\",\"Z\",AB327)","v":"Z"}," ",{"$f":"IF(ISERROR(VLOOKUP(AD327,$AV$14:$AW$87,2)),\"\",VLOOKUP(AD327,$AV$14:$AW$87,2))","v":""},{"$f":"IF(AD327=\"\",\"\",COUNTIF(AD:AD,AD327))","v":""},null,null,null,null,null,null,null,{"$f":"IF(OR(AE327=\"\",AH327=\"\",AI327=\"\"),\"\",IF(AH327=\"part time\",\"\",AI327-AH327))","v":""}]
[null,null,null,null,null,null,null,null,null,null,null,null,null,null,null,null,null,null,null,null,null,null,null,null,null,{"$f":"IF(AB328=\"\",\"Z\",AB328)","v":"Z"}," ",{"$f":"IF(ISERROR(VLOOKUP(AD328,$AV$14:$AW$87,2)),\"\",VLOOKUP(AD328,$AV$14:$AW$87,2))","v":""},{"$f":"IF(AD328=\"\",\"\",COUNTIF(AD:AD,AD328))","v":""},null,null,null,null,null,null,null,{"$f":"IF(OR(AE328=\"\",AH328=\"\",AI328=\"\"),\"\",IF(AH328=\"part time\",\"\",AI328-AH328))","v":""}]
[null,null,null,null,null,null,null,null,null,null,null,null,null,null,null,null,null,null,null,null,null,null,null,null,null,{"$f":"IF(AB329=\"\",\"Z\",AB329)","v":"Z"}," ",{"$f":"IF(ISERROR(VLOOKUP(AD329,$AV$14:$AW$87,2)),\"\",VLOOKUP(AD329,$AV$14:$AW$87,2))","v":""},{"$f":"IF(AD329=\"\",\"\",COUNTIF(AD:AD,AD329))","v":""},null,null,null,null,null,null,null,{"$f":"IF(OR(AE329=\"\",AH329=\"\",AI329=\"\"),\"\",IF(AH329=\"part time\",\"\",AI329-AH329))","v":""}]
[null,null,null,null,null,null,null,null,null,null,null,null,null,null,null,null,null,null,null,null,null,null,null,null,null,{"$f":"IF(AB330=\"\",\"Z\",AB330)","v":"Z"}," ",{"$f":"IF(ISERROR(VLOOKUP(AD330,$AV$14:$AW$87,2)),\"\",VLOOKUP(AD330,$AV$14:$AW$87,2))","v":""},{"$f":"IF(AD330=\"\",\"\",COUNTIF(AD:AD,AD330))","v":""},null,null,null,null,null,null,null,{"$f":"IF(OR(AE330=\"\",AH330=\"\",AI330=\"\"),\"\",IF(AH330=\"part time\",\"\",AI330-AH330))","v":""}]
[null,null,null,null,null,null,null,null,null,null,null,null,null,null,null,null,null,null,null,null,null,null,null,null,null,{"$f":"IF(AB331=\"\",\"Z\",AB331)","v":"Z"}," ",{"$f":"IF(ISERROR(VLOOKUP(AD331,$AV$14:$AW$87,2)),\"\",VLOOKUP(AD331,$AV$14:$AW$87,2))","v":""},{"$f":"IF(AD331=\"\",\"\",COUNTIF(AD:AD,AD331))","v":""},null,null,null,null,null,null,null,{"$f":"IF(OR(AE331=\"\",AH331=\"\",AI331=\"\"),\"\",IF(AH331=\"part time\",\"\",AI331-AH331))","v":""}]
[null,null,null,null,null,null,null,null,null,null,null,null,null,null,null,null,null,null,null,null,null,null,null,null,null,{"$f":"IF(AB332=\"\",\"Z\",AB332)","v":"Z"}," ",{"$f":"IF(ISERROR(VLOOKUP(AD332,$AV$14:$AW$87,2)),\"\",VLOOKUP(AD332,$AV$14:$AW$87,2))","v":""},{"$f":"IF(AD332=\"\",\"\",COUNTIF(AD:AD,AD332))","v":""},null,null,null,null,null,null,null,{"$f":"IF(OR(AE332=\"\",AH332=\"\",AI332=\"\"),\"\",IF(AH332=\"part time\",\"\",AI332-AH332))","v":""}]
[null,null,null,null,null,null,null,null,null,null,null,null,null,null,null,null,null,null,null,null,null,null,null,null,null,{"$f":"IF(AB333=\"\",\"Z\",AB333)","v":"Z"}," ",{"$f":"IF(ISERROR(VLOOKUP(AD333,$AV$14:$AW$87,2)),\"\",VLOOKUP(AD333,$AV$14:$AW$87,2))","v":""},{"$f":"IF(AD333=\"\",\"\",COUNTIF(AD:AD,AD333))","v":""},null,null,null,null,null,null,null,{"$f":"IF(OR(AE333=\"\",AH333=\"\",AI333=\"\"),\"\",IF(AH333=\"part time\",\"\",AI333-AH333))","v":""}]
[null,null,null,null,null,null,null,null,null,null,null,null,null,null,null,null,null,null,null,null,null,null,null,null,null,{"$f":"IF(AB334=\"\",\"Z\",AB334)","v":"Z"}," ",{"$f":"IF(ISERROR(VLOOKUP(AD334,$AV$14:$AW$87,2)),\"\",VLOOKUP(AD334,$AV$14:$AW$87,2))","v":""},{"$f":"IF(AD334=\"\",\"\",COUNTIF(AD:AD,AD334))","v":""},null,null,null,null,null,null,null,{"$f":"IF(OR(AE334=\"\",AH334=\"\",AI334=\"\"),\"\",IF(AH334=\"part time\",\"\",AI334-AH334))","v":""}]
[null,null,null,null,null,null,null,null,null,null,null,null,null,null,null,null,null,null,null,null,null,null,null,null,null,{"$f":"IF(AB335=\"\",\"Z\",AB335)","v":"Z"}," ",{"$f":"IF(ISERROR(VLOOKUP(AD335,$AV$14:$AW$87,2)),\"\",VLOOKUP(AD335,$AV$14:$AW$87,2))","v":""},{"$f":"IF(AD335=\"\",\"\",COUNTIF(AD:AD,AD335))","v":""},null,null,null,null,null,null,null,{"$f":"IF(OR(AE335=\"\",AH335=\"\",AI335=\"\"),\"\",IF(AH335=\"part time\",\"\",AI335-AH335))","v":""}]
[null,null,null,null,null,null,null,null,null,null,null,null,null,null,null,null,null,null,null,null,null,null,null,null,null,{"$f":"IF(AB336=\"\",\"Z\",AB336)","v":"Z"}," ",{"$f":"IF(ISERROR(VLOOKUP(AD336,$AV$14:$AW$87,2)),\"\",VLOOKUP(AD336,$AV$14:$AW$87,2))","v":""},{"$f":"IF(AD336=\"\",\"\",COUNTIF(AD:AD,AD336))","v":""},null,null,null,null,null,null,null,{"$f":"IF(OR(AE336=\"\",AH336=\"\",AI336=\"\"),\"\",IF(AH336=\"part time\",\"\",AI336-AH336))","v":""}]
[null,null,null,null,null,null,null,null,null,null,null,null,null,null,null,null,null,null,null,null,null,null,null,null,null,{"$f":"IF(AB337=\"\",\"Z\",AB337)","v":"Z"}," ",{"$f":"IF(ISERROR(VLOOKUP(AD337,$AV$14:$AW$87,2)),\"\",VLOOKUP(AD337,$AV$14:$AW$87,2))","v":""},{"$f":"IF(AD337=\"\",\"\",COUNTIF(AD:AD,AD337))","v":""},null,null,null,null,null,null,null,{"$f":"IF(OR(AE337=\"\",AH337=\"\",AI337=\"\"),\"\",IF(AH337=\"part time\",\"\",AI337-AH337))","v":""}]
[null,null,null,null,null,null,null,null,null,null,null,null,null,null,null,null,null,null,null,null,null,null,null,null,null,{"$f":"IF(AB338=\"\",\"Z\",AB338)","v":"Z"}," ",{"$f":"IF(ISERROR(VLOOKUP(AD338,$AV$14:$AW$87,2)),\"\",VLOOKUP(AD338,$AV$14:$AW$87,2))","v":""},{"$f":"IF(AD338=\"\",\"\",COUNTIF(AD:AD,AD338))","v":""},null,null,null,null,null,null,null,{"$f":"IF(OR(AE338=\"\",AH338=\"\",AI338=\"\"),\"\",IF(AH338=\"part time\",\"\",AI338-AH338))","v":""}]
[null,null,null,null,null,null,null,null,null,null,null,null,null,null,null,null,null,null,null,null,null,null,null,null,null,{"$f":"IF(AB339=\"\",\"Z\",AB339)","v":"Z"}," ",{"$f":"IF(ISERROR(VLOOKUP(AD339,$AV$14:$AW$87,2)),\"\",VLOOKUP(AD339,$AV$14:$AW$87,2))","v":""},{"$f":"IF(AD339=\"\",\"\",COUNTIF(AD:AD,AD339))","v":""},null,null,null,null,null,null,null,{"$f":"IF(OR(AE339=\"\",AH339=\"\",AI339=\"\"),\"\",IF(AH339=\"part time\",\"\",AI339-AH339))","v":""}]
[null,null,null,null,null,null,null,null,null,null,null,null,null,null,null,null,null,null,null,null,null,null,null,null,null,{"$f":"IF(AB340=\"\",\"Z\",AB340)","v":"Z"}," ",{"$f":"IF(ISERROR(VLOOKUP(AD340,$AV$14:$AW$87,2)),\"\",VLOOKUP(AD340,$AV$14:$AW$87,2))","v":""},{"$f":"IF(AD340=\"\",\"\",COUNTIF(AD:AD,AD340))","v":""},null,null,null,null,null,null,null,{"$f":"IF(OR(AE340=\"\",AH340=\"\",AI340=\"\"),\"\",IF(AH340=\"part time\",\"\",AI340-AH340))","v":""}]
[null,null,null,null,null,null,null,null,null,null,null,null,null,null,null,null,null,null,null,null,null,null,null,null,null,{"$f":"IF(AB341=\"\",\"Z\",AB341)","v":"Z"}," ",{"$f":"IF(ISERROR(VLOOKUP(AD341,$AV$14:$AW$87,2)),\"\",VLOOKUP(AD341,$AV$14:$AW$87,2))","v":""},{"$f":"IF(AD341=\"\",\"\",COUNTIF(AD:AD,AD341))","v":""},null,null,null,null,null,null,null,{"$f":"IF(OR(AE341=\"\",AH341=\"\",AI341=\"\"),\"\",IF(AH341=\"part time\",\"\",AI341-AH341))","v":""}]
[null,null,null,null,null,null,null,null,null,null,null,null,null,null,null,null,null,null,null,null,null,null,null,null,null,{"$f":"IF(AB342=\"\",\"Z\",AB342)","v":"Z"}," ",{"$f":"IF(ISERROR(VLOOKUP(AD342,$AV$14:$AW$87,2)),\"\",VLOOKUP(AD342,$AV$14:$AW$87,2))","v":""},{"$f":"IF(AD342=\"\",\"\",COUNTIF(AD:AD,AD342))","v":""},null,null,null,null,null,null,null,{"$f":"IF(OR(AE342=\"\",AH342=\"\",AI342=\"\"),\"\",IF(AH342=\"part time\",\"\",AI342-AH342))","v":""}]
[null,null,null,null,null,null,null,null,null,null,null,null,null,null,null,null,null,null,null,null,null,null,null,null,null,{"$f":"IF(AB343=\"\",\"Z\",AB343)","v":"Z"}," ",{"$f":"IF(ISERROR(VLOOKUP(AD343,$AV$14:$AW$87,2)),\"\",VLOOKUP(AD343,$AV$14:$AW$87,2))","v":""},{"$f":"IF(AD343=\"\",\"\",COUNTIF(AD:AD,AD343))","v":""},null,null,null,null,null,null,null,{"$f":"IF(OR(AE343=\"\",AH343=\"\",AI343=\"\"),\"\",IF(AH343=\"part time\",\"\",AI343-AH343))","v":""}]
[null,null,null,null,null,null,null,null,null,null,null,null,null,null,null,null,null,null,null,null,null,null,null,null,null,{"$f":"IF(AB344=\"\",\"Z\",AB344)","v":"Z"}," ",{"$f":"IF(ISERROR(VLOOKUP(AD344,$AV$14:$AW$87,2)),\"\",VLOOKUP(AD344,$AV$14:$AW$87,2))","v":""},{"$f":"IF(AD344=\"\",\"\",COUNTIF(AD:AD,AD344))","v":""},null,null,null,null,null,null,null,{"$f":"IF(OR(AE344=\"\",AH344=\"\",AI344=\"\"),\"\",IF(AH344=\"part time\",\"\",AI344-AH344))","v":""}]
[null,null,null,null,null,null,null,null,null,null,null,null,null,null,null,null,null,null,null,null,null,null,null,null,null,{"$f":"IF(AB345=\"\",\"Z\",AB345)","v":"Z"}," ",{"$f":"IF(ISERROR(VLOOKUP(AD345,$AV$14:$AW$87,2)),\"\",VLOOKUP(AD345,$AV$14:$AW$87,2))","v":""},{"$f":"IF(AD345=\"\",\"\",COUNTIF(AD:AD,AD345))","v":""},null,null,null,null,null,null,null,{"$f":"IF(OR(AE345=\"\",AH345=\"\",AI345=\"\"),\"\",IF(AH345=\"part time\",\"\",AI345-AH345))","v":""}]
[null,null,null,null,null,null,null,null,null,null,null,null,null,null,null,null,null,null,null,null,null,null,null,null,null,{"$f":"IF(AB346=\"\",\"Z\",AB346)","v":"Z"}," ",{"$f":"IF(ISERROR(VLOOKUP(AD346,$AV$14:$AW$87,2)),\"\",VLOOKUP(AD346,$AV$14:$AW$87,2))","v":""},{"$f":"IF(AD346=\"\",\"\",COUNTIF(AD:AD,AD346))","v":""},null,null,null,null,null,null,null,{"$f":"IF(OR(AE346=\"\",AH346=\"\",AI346=\"\"),\"\",IF(AH346=\"part time\",\"\",AI346-AH346))","v":""}]
[null,null,null,null,null,null,null,null,null,null,null,null,null,null,null,null,null,null,null,null,null,null,null,null,null,{"$f":"IF(AB347=\"\",\"Z\",AB347)","v":"Z"}," ",{"$f":"IF(ISERROR(VLOOKUP(AD347,$AV$14:$AW$87,2)),\"\",VLOOKUP(AD347,$AV$14:$AW$87,2))","v":""},{"$f":"IF(AD347=\"\",\"\",COUNTIF(AD:AD,AD347))","v":""},null,null,null,null,null,null,null,{"$f":"IF(OR(AE347=\"\",AH347=\"\",AI347=\"\"),\"\",IF(AH347=\"part time\",\"\",AI347-AH347))","v":""}]
[null,null,null,null,null,null,null,null,null,null,null,null,null,null,null,null,null,null,null,null,null,null,null,null,null,{"$f":"IF(AB348=\"\",\"Z\",AB348)","v":"Z"}," ",{"$f":"IF(ISERROR(VLOOKUP(AD348,$AV$14:$AW$87,2)),\"\",VLOOKUP(AD348,$AV$14:$AW$87,2))","v":""},{"$f":"IF(AD348=\"\",\"\",COUNTIF(AD:AD,AD348))","v":""},null,null,null,null,null,null,null,{"$f":"IF(OR(AE348=\"\",AH348=\"\",AI348=\"\"),\"\",IF(AH348=\"part time\",\"\",AI348-AH348))","v":""}]
[null,null,null,null,null,null,null,null,null,null,null,null,null,null,null,null,null,null,null,null,null,null,null,null,null,{"$f":"IF(AB349=\"\",\"Z\",AB349)","v":"Z"}," ",{"$f":"IF(ISERROR(VLOOKUP(AD349,$AV$14:$AW$87,2)),\"\",VLOOKUP(AD349,$AV$14:$AW$87,2))","v":""},{"$f":"IF(AD349=\"\",\"\",COUNTIF(AD:AD,AD349))","v":""},null,null,null,null,null,null,null,{"$f":"IF(OR(AE349=\"\",AH349=\"\",AI349=\"\"),\"\",IF(AH349=\"part time\",\"\",AI349-AH349))","v":""}]
[null,null,null,null,null,null,null,null,null,null,null,null,null,null,null,null,null,null,null,null,null,null,null,null,null,{"$f":"IF(AB350=\"\",\"Z\",AB350)","v":"Z"}," ",{"$f":"IF(ISERROR(VLOOKUP(AD350,$AV$14:$AW$87,2)),\"\",VLOOKUP(AD350,$AV$14:$AW$87,2))","v":""},{"$f":"IF(AD350=\"\",\"\",COUNTIF(AD:AD,AD350))","v":""},null,null,null,null,null,null,null,{"$f":"IF(OR(AE350=\"\",AH350=\"\",AI350=\"\"),\"\",IF(AH350=\"part time\",\"\",AI350-AH350))","v":""}]
[null,null,null,null,null,null,null,null,null,null,null,null,null,null,null,null,null,null,null,null,null,null,null,null,null,{"$f":"IF(AB351=\"\",\"Z\",AB351)","v":"Z"}," ",{"$f":"IF(ISERROR(VLOOKUP(AD351,$AV$14:$AW$87,2)),\"\",VLOOKUP(AD351,$AV$14:$AW$87,2))","v":""},{"$f":"IF(AD351=\"\",\"\",COUNTIF(AD:AD,AD351))","v":""},null,null,null,null,null,null,null,{"$f":"IF(OR(AE351=\"\",AH351=\"\",AI351=\"\"),\"\",IF(AH351=\"part time\",\"\",AI351-AH351))","v":""}]
[null,null,null,null,null,null,null,null,null,null,null,null,null,null,null,null,null,null,null,null,null,null,null,null,null,{"$f":"IF(AB352=\"\",\"Z\",AB352)","v":"Z"}," ",{"$f":"IF(ISERROR(VLOOKUP(AD352,$AV$14:$AW$87,2)),\"\",VLOOKUP(AD352,$AV$14:$AW$87,2))","v":""},{"$f":"IF(AD352=\"\",\"\",COUNTIF(AD:AD,AD352))","v":""},null,null,null,null,null,null,null,{"$f":"IF(OR(AE352=\"\",AH352=\"\",AI352=\"\"),\"\",IF(AH352=\"part time\",\"\",AI352-AH352))","v":""}]
[null,null,null,null,null,null,null,null,null,null,null,null,null,null,null,null,null,null,null,null,null,null,null,null,null,{"$f":"IF(AB353=\"\",\"Z\",AB353)","v":"Z"}," ",{"$f":"IF(ISERROR(VLOOKUP(AD353,$AV$14:$AW$87,2)),\"\",VLOOKUP(AD353,$AV$14:$AW$87,2))","v":""},{"$f":"IF(AD353=\"\",\"\",COUNTIF(AD:AD,AD353))","v":""},null,null,null,null,null,null,null,{"$f":"IF(OR(AE353=\"\",AH353=\"\",AI353=\"\"),\"\",IF(AH353=\"part time\",\"\",AI353-AH353))","v":""}]
[null,null,null,null,null,null,null,null,null,null,null,null,null,null,null,null,null,null,null,null,null,null,null,null,null,{"$f":"IF(AB354=\"\",\"Z\",AB354)","v":"Z"}," ",{"$f":"IF(ISERROR(VLOOKUP(AD354,$AV$14:$AW$87,2)),\"\",VLOOKUP(AD354,$AV$14:$AW$87,2))","v":""},{"$f":"IF(AD354=\"\",\"\",COUNTIF(AD:AD,AD354))","v":""},null,null,null,null,null,null,null,{"$f":"IF(OR(AE354=\"\",AH354=\"\",AI354=\"\"),\"\",IF(AH354=\"part time\",\"\",AI354-AH354))","v":""}]
[null,null,null,null,null,null,null,null,null,null,null,null,null,null,null,null,null,null,null,null,null,null,null,null,null,{"$f":"IF(AB355=\"\",\"Z\",AB355)","v":"Z"}," ",{"$f":"IF(ISERROR(VLOOKUP(AD355,$AV$14:$AW$87,2)),\"\",VLOOKUP(AD355,$AV$14:$AW$87,2))","v":""},{"$f":"IF(AD355=\"\",\"\",COUNTIF(AD:AD,AD355))","v":""},null,null,null,null,null,null,null,{"$f":"IF(OR(AE355=\"\",AH355=\"\",AI355=\"\"),\"\",IF(AH355=\"part time\",\"\",AI355-AH355))","v":""}]
[null,null,null,null,null,null,null,null,null,null,null,null,null,null,null,null,null,null,null,null,null,null,null,null,null,{"$f":"IF(AB356=\"\",\"Z\",AB356)","v":"Z"}," ",{"$f":"IF(ISERROR(VLOOKUP(AD356,$AV$14:$AW$87,2)),\"\",VLOOKUP(AD356,$AV$14:$AW$87,2))","v":""},{"$f":"IF(AD356=\"\",\"\",COUNTIF(AD:AD,AD356))","v":""},null,null,null,null,null,null,null,{"$f":"IF(OR(AE356=\"\",AH356=\"\",AI356=\"\"),\"\",IF(AH356=\"part time\",\"\",AI356-AH356))","v":""}]
[null,null,null,null,null,null,null,null,null,null,null,null,null,null,null,null,null,null,null,null,null,null,null,null,null,{"$f":"IF(AB357=\"\",\"Z\",AB357)","v":"Z"}," ",{"$f":"IF(ISERROR(VLOOKUP(AD357,$AV$14:$AW$87,2)),\"\",VLOOKUP(AD357,$AV$14:$AW$87,2))","v":""},{"$f":"IF(AD357=\"\",\"\",COUNTIF(AD:AD,AD357))","v":""},null,null,null,null,null,null,null,{"$f":"IF(OR(AE357=\"\",AH357=\"\",AI357=\"\"),\"\",IF(AH357=\"part time\",\"\",AI357-AH357))","v":""}]
[null,null,null,null,null,null,null,null,null,null,null,null,null,null,null,null,null,null,null,null,null,null,null,null,null,{"$f":"IF(AB358=\"\",\"Z\",AB358)","v":"Z"}," ",{"$f":"IF(ISERROR(VLOOKUP(AD358,$AV$14:$AW$87,2)),\"\",VLOOKUP(AD358,$AV$14:$AW$87,2))","v":""},{"$f":"IF(AD358=\"\",\"\",COUNTIF(AD:AD,AD358))","v":""},null,null,null,null,null,null,null,{"$f":"IF(OR(AE358=\"\",AH358=\"\",AI358=\"\"),\"\",IF(AH358=\"part time\",\"\",AI358-AH358))","v":""}]
[null,null,null,null,null,null,null,null,null,null,null,null,null,null,null,null,null,null,null,null,null,null,null,null,null,{"$f":"IF(AB359=\"\",\"Z\",AB359)","v":"Z"}," ",{"$f":"IF(ISERROR(VLOOKUP(AD359,$AV$14:$AW$87,2)),\"\",VLOOKUP(AD359,$AV$14:$AW$87,2))","v":""},{"$f":"IF(AD359=\"\",\"\",COUNTIF(AD:AD,AD359))","v":""},null,null,null,null,null,null,null,{"$f":"IF(OR(AE359=\"\",AH359=\"\",AI359=\"\"),\"\",IF(AH359=\"part time\",\"\",AI359-AH359))","v":""}]
[null,null,null,null,null,null,null,null,null,null,null,null,null,null,null,null,null,null,null,null,null,null,null,null,null,{"$f":"IF(AB360=\"\",\"Z\",AB360)","v":"Z"}," ",{"$f":"IF(ISERROR(VLOOKUP(AD360,$AV$14:$AW$87,2)),\"\",VLOOKUP(AD360,$AV$14:$AW$87,2))","v":""},{"$f":"IF(AD360=\"\",\"\",COUNTIF(AD:AD,AD360))","v":""},null,null,null,null,null,null,null,{"$f":"IF(OR(AE360=\"\",AH360=\"\",AI360=\"\"),\"\",IF(AH360=\"part time\",\"\",AI360-AH360))","v":""}]
[null,null,null,null,null,null,null,null,null,null,null,null,null,null,null,null,null,null,null,null,null,null,null,null,null,{"$f":"IF(AB361=\"\",\"Z\",AB361)","v":"Z"}," ",{"$f":"IF(ISERROR(VLOOKUP(AD361,$AV$14:$AW$87,2)),\"\",VLOOKUP(AD361,$AV$14:$AW$87,2))","v":""},{"$f":"IF(AD361=\"\",\"\",COUNTIF(AD:AD,AD361))","v":""},null,null,null,null,null,null,null,{"$f":"IF(OR(AE361=\"\",AH361=\"\",AI361=\"\"),\"\",IF(AH361=\"part time\",\"\",AI361-AH361))","v":""}]
[null,null,null,null,null,null,null,null,null,null,null,null,null,null,null,null,null,null,null,null,null,null,null,null,null,{"$f":"IF(AB362=\"\",\"Z\",AB362)","v":"Z"}," ",{"$f":"IF(ISERROR(VLOOKUP(AD362,$AV$14:$AW$87,2)),\"\",VLOOKUP(AD362,$AV$14:$AW$87,2))","v":""},{"$f":"IF(AD362=\"\",\"\",COUNTIF(AD:AD,AD362))","v":""},null,null,null,null,null,null,null,{"$f":"IF(OR(AE362=\"\",AH362=\"\",AI362=\"\"),\"\",IF(AH362=\"part time\",\"\",AI362-AH362))","v":""}]
[null,null,null,null,null,null,null,null,null,null,null,null,null,null,null,null,null,null,null,null,null,null,null,null,null,{"$f":"IF(AB363=\"\",\"Z\",AB363)","v":"Z"}," ",{"$f":"IF(ISERROR(VLOOKUP(AD363,$AV$14:$AW$87,2)),\"\",VLOOKUP(AD363,$AV$14:$AW$87,2))","v":""},{"$f":"IF(AD363=\"\",\"\",COUNTIF(AD:AD,AD363))","v":""},null,null,null,null,null,null,null,{"$f":"IF(OR(AE363=\"\",AH363=\"\",AI363=\"\"),\"\",IF(AH363=\"part time\",\"\",AI363-AH363))","v":""}]
[null,null,null,null,null,null,null,null,null,null,null,null,null,null,null,null,null,null,null,null,null,null,null,null,null,{"$f":"IF(AB364=\"\",\"Z\",AB364)","v":"Z"}," ",{"$f":"IF(ISERROR(VLOOKUP(AD364,$AV$14:$AW$87,2)),\"\",VLOOKUP(AD364,$AV$14:$AW$87,2))","v":""},{"$f":"IF(AD364=\"\",\"\",COUNTIF(AD:AD,AD364))","v":""},null,null,null,null,null,null,null,{"$f":"IF(OR(AE364=\"\",AH364=\"\",AI364=\"\"),\"\",IF(AH364=\"part time\",\"\",AI364-AH364))","v":""}]
[null,null,null,null,null,null,null,null,null,null,null,null,null,null,null,null,null,null,null,null,null,null,null,null,null,{"$f":"IF(AB365=\"\",\"Z\",AB365)","v":"Z"}," ",{"$f":"IF(ISERROR(VLOOKUP(AD365,$AV$14:$AW$87,2)),\"\",VLOOKUP(AD365,$AV$14:$AW$87,2))","v":""},{"$f":"IF(AD365=\"\",\"\",COUNTIF(AD:AD,AD365))","v":""},null,null,null,null,null,null,null,{"$f":"IF(OR(AE365=\"\",AH365=\"\",AI365=\"\"),\"\",IF(AH365=\"part time\",\"\",AI365-AH365))","v":""}]
[null,null,null,null,null,null,null,null,null,null,null,null,null,null,null,null,null,null,null,null,null,null,null,null,null,{"$f":"IF(AB366=\"\",\"Z\",AB366)","v":"Z"}," ",{"$f":"IF(ISERROR(VLOOKUP(AD366,$AV$14:$AW$87,2)),\"\",VLOOKUP(AD366,$AV$14:$AW$87,2))","v":""},{"$f":"IF(AD366=\"\",\"\",COUNTIF(AD:AD,AD366))","v":""},null,null,null,null,null,null,null,{"$f":"IF(OR(AE366=\"\",AH366=\"\",AI366=\"\"),\"\",IF(AH366=\"part time\",\"\",AI366-AH366))","v":""}]
[null,null,null,null,null,null,null,null,null,null,null,null,null,null,null,null,null,null,null,null,null,null,null,null,null,{"$f":"IF(AB367=\"\",\"Z\",AB367)","v":"Z"}," ",{"$f":"IF(ISERROR(VLOOKUP(AD367,$AV$14:$AW$87,2)),\"\",VLOOKUP(AD367,$AV$14:$AW$87,2))","v":""},{"$f":"IF(AD367=\"\",\"\",COUNTIF(AD:AD,AD367))","v":""},null,null,null,null,null,null,null,{"$f":"IF(OR(AE367=\"\",AH367=\"\",AI367=\"\"),\"\",IF(AH367=\"part time\",\"\",AI367-AH367))","v":""}]
[null,null,null,null,null,null,null,null,null,null,null,null,null,null,null,null,null,null,null,null,null,null,null,null,null,{"$f":"IF(AB368=\"\",\"Z\",AB368)","v":"Z"}," ",{"$f":"IF(ISERROR(VLOOKUP(AD368,$AV$14:$AW$87,2)),\"\",VLOOKUP(AD368,$AV$14:$AW$87,2))","v":""},{"$f":"IF(AD368=\"\",\"\",COUNTIF(AD:AD,AD368))","v":""},null,null,null,null,null,null,null,{"$f":"IF(OR(AE368=\"\",AH368=\"\",AI368=\"\"),\"\",IF(AH368=\"part time\",\"\",AI368-AH368))","v":""}]
[null,null,null,null,null,null,null,null,null,null,null,null,null,null,null,null,null,null,null,null,null,null,null,null,null,{"$f":"IF(AB369=\"\",\"Z\",AB369)","v":"Z"}," ",{"$f":"IF(ISERROR(VLOOKUP(AD369,$AV$14:$AW$87,2)),\"\",VLOOKUP(AD369,$AV$14:$AW$87,2))","v":""},{"$f":"IF(AD369=\"\",\"\",COUNTIF(AD:AD,AD369))","v":""},null,null,null,null,null,null,null,{"$f":"IF(OR(AE369=\"\",AH369=\"\",AI369=\"\"),\"\",IF(AH369=\"part time\",\"\",AI369-AH369))","v":""}]
[null,null,null,null,null,null,null,null,null,null,null,null,null,null,null,null,null,null,null,null,null,null,null,null,null,{"$f":"IF(AB370=\"\",\"Z\",AB370)","v":"Z"}," ",{"$f":"IF(ISERROR(VLOOKUP(AD370,$AV$14:$AW$87,2)),\"\",VLOOKUP(AD370,$AV$14:$AW$87,2))","v":""},{"$f":"IF(AD370=\"\",\"\",COUNTIF(AD:AD,AD370))","v":""},null,null,null,null,null,null,null,{"$f":"IF(OR(AE370=\"\",AH370=\"\",AI370=\"\"),\"\",IF(AH370=\"part time\",\"\",AI370-AH370))","v":""}]
[null,null,null,null,null,null,null,null,null,null,null,null,null,null,null,null,null,null,null,null,null,null,null,null,null,{"$f":"IF(AB371=\"\",\"Z\",AB371)","v":"Z"}," ",{"$f":"IF(ISERROR(VLOOKUP(AD371,$AV$14:$AW$87,2)),\"\",VLOOKUP(AD371,$AV$14:$AW$87,2))","v":""},{"$f":"IF(AD371=\"\",\"\",COUNTIF(AD:AD,AD371))","v":""},null,null,null,null,null,null,null,{"$f":"IF(OR(AE371=\"\",AH371=\"\",AI371=\"\"),\"\",IF(AH371=\"part time\",\"\",AI371-AH371))","v":""}]
[null,null,null,null,null,null,null,null,null,null,null,null,null,null,null,null,null,null,null,null,null,null,null,null,null,{"$f":"IF(AB372=\"\",\"Z\",AB372)","v":"Z"}," ",{"$f":"IF(ISERROR(VLOOKUP(AD372,$AV$14:$AW$87,2)),\"\",VLOOKUP(AD372,$AV$14:$AW$87,2))","v":""},{"$f":"IF(AD372=\"\",\"\",COUNTIF(AD:AD,AD372))","v":""},null,null,null,null,null,null,null,{"$f":"IF(OR(AE372=\"\",AH372=\"\",AI372=\"\"),\"\",IF(AH372=\"part time\",\"\",AI372-AH372))","v":""}]
[null,null,null,null,null,null,null,null,null,null,null,null,null,null,null,null,null,null,null,null,null,null,null,null,null,{"$f":"IF(AB373=\"\",\"Z\",AB373)","v":"Z"}," ",{"$f":"IF(ISERROR(VLOOKUP(AD373,$AV$14:$AW$87,2)),\"\",VLOOKUP(AD373,$AV$14:$AW$87,2))","v":""},{"$f":"IF(AD373=\"\",\"\",COUNTIF(AD:AD,AD373))","v":""},null,null,null,null,null,null,null,{"$f":"IF(OR(AE373=\"\",AH373=\"\",AI373=\"\"),\"\",IF(AH373=\"part time\",\"\",AI373-AH373))","v":""}]
[null,null,null,null,null,null,null,null,null,null,null,null,null,null,null,null,null,null,null,null,null,null,null,null,null,{"$f":"IF(AB374=\"\",\"Z\",AB374)","v":"Z"}," ",{"$f":"IF(ISERROR(VLOOKUP(AD374,$AV$14:$AW$87,2)),\"\",VLOOKUP(AD374,$AV$14:$AW$87,2))","v":""},{"$f":"IF(AD374=\"\",\"\",COUNTIF(AD:AD,AD374))","v":""},null,null,null,null,null,null,null,{"$f":"IF(OR(AE374=\"\",AH374=\"\",AI374=\"\"),\"\",IF(AH374=\"part time\",\"\",AI374-AH374))","v":""}]
[null,null,null,null,null,null,null,null,null,null,null,null,null,null,null,null,null,null,null,null,null,null,null,null,null,{"$f":"IF(AB375=\"\",\"Z\",AB375)","v":"Z"}," ",{"$f":"IF(ISERROR(VLOOKUP(AD375,$AV$14:$AW$87,2)),\"\",VLOOKUP(AD375,$AV$14:$AW$87,2))","v":""},{"$f":"IF(AD375=\"\",\"\",COUNTIF(AD:AD,AD375))","v":""},null,null,null,null,null,null,null,{"$f":"IF(OR(AE375=\"\",AH375=\"\",AI375=\"\"),\"\",IF(AH375=\"part time\",\"\",AI375-AH375))","v":""}]
[null,null,null,null,null,null,null,null,null,null,null,null,null,null,null,null,null,null,null,null,null,null,null,null,null,{"$f":"IF(AB376=\"\",\"Z\",AB376)","v":"Z"}," ",{"$f":"IF(ISERROR(VLOOKUP(AD376,$AV$14:$AW$87,2)),\"\",VLOOKUP(AD376,$AV$14:$AW$87,2))","v":""},{"$f":"IF(AD376=\"\",\"\",COUNTIF(AD:AD,AD376))","v":""},null,null,null,null,null,null,null,{"$f":"IF(OR(AE376=\"\",AH376=\"\",AI376=\"\"),\"\",IF(AH376=\"part time\",\"\",AI376-AH376))","v":""}]
[null,null,null,null,null,null,null,null,null,null,null,null,null,null,null,null,null,null,null,null,null,null,null,null,null,{"$f":"IF(AB377=\"\",\"Z\",AB377)","v":"Z"}," ",{"$f":"IF(ISERROR(VLOOKUP(AD377,$AV$14:$AW$87,2)),\"\",VLOOKUP(AD377,$AV$14:$AW$87,2))","v":""},{"$f":"IF(AD377=\"\",\"\",COUNTIF(AD:AD,AD377))","v":""},null,null,null,null,null,null,null,{"$f":"IF(OR(AE377=\"\",AH377=\"\",AI377=\"\"),\"\",IF(AH377=\"part time\",\"\",AI377-AH377))","v":""}]
[null,null,null,null,null,null,null,null,null,null,null,null,null,null,null,null,null,null,null,null,null,null,null,null,null,{"$f":"IF(AB378=\"\",\"Z\",AB378)","v":"Z"}," ",{"$f":"IF(ISERROR(VLOOKUP(AD378,$AV$14:$AW$87,2)),\"\",VLOOKUP(AD378,$AV$14:$AW$87,2))","v":""},{"$f":"IF(AD378=\"\",\"\",COUNTIF(AD:AD,AD378))","v":""},null,null,null,null,null,null,null,{"$f":"IF(OR(AE378=\"\",AH378=\"\",AI378=\"\"),\"\",IF(AH378=\"part time\",\"\",AI378-AH378))","v":""}]
[null,null,null,null,null,null,null,null,null,null,null,null,null,null,null,null,null,null,null,null,null,null,null,null,null,{"$f":"IF(AB379=\"\",\"Z\",AB379)","v":"Z"}," ",{"$f":"IF(ISERROR(VLOOKUP(AD379,$AV$14:$AW$87,2)),\"\",VLOOKUP(AD379,$AV$14:$AW$87,2))","v":""},{"$f":"IF(AD379=\"\",\"\",COUNTIF(AD:AD,AD379))","v":""},null,null,null,null,null,null,null,{"$f":"IF(OR(AE379=\"\",AH379=\"\",AI379=\"\"),\"\",IF(AH379=\"part time\",\"\",AI379-AH379))","v":""}]
[null,null,null,null,null,null,null,null,null,null,null,null,null,null,null,null,null,null,null,null,null,null,null,null,null,{"$f":"IF(AB380=\"\",\"Z\",AB380)","v":"Z"}," ",{"$f":"IF(ISERROR(VLOOKUP(AD380,$AV$14:$AW$87,2)),\"\",VLOOKUP(AD380,$AV$14:$AW$87,2))","v":""},{"$f":"IF(AD380=\"\",\"\",COUNTIF(AD:AD,AD380))","v":""},null,null,null,null,null,null,null,{"$f":"IF(OR(AE380=\"\",AH380=\"\",AI380=\"\"),\"\",IF(AH380=\"part time\",\"\",AI380-AH380))","v":""}]
[null,null,null,null,null,null,null,null,null,null,null,null,null,null,null,null,null,null,null,null,null,null,null,null,null,{"$f":"IF(AB381=\"\",\"Z\",AB381)","v":"Z"}," ",{"$f":"IF(ISERROR(VLOOKUP(AD381,$AV$14:$AW$87,2)),\"\",VLOOKUP(AD381,$AV$14:$AW$87,2))","v":""},{"$f":"IF(AD381=\"\",\"\",COUNTIF(AD:AD,AD381))","v":""},null,null,null,null,null,null,null,{"$f":"IF(OR(AE381=\"\",AH381=\"\",AI381=\"\"),\"\",IF(AH381=\"part time\",\"\",AI381-AH381))","v":""}]
[null,null,null,null,null,null,null,null,null,null,null,null,null,null,null,null,null,null,null,null,null,null,null,null,null,{"$f":"IF(AB382=\"\",\"Z\",AB382)","v":"Z"}," ",{"$f":"IF(ISERROR(VLOOKUP(AD382,$AV$14:$AW$87,2)),\"\",VLOOKUP(AD382,$AV$14:$AW$87,2))","v":""},{"$f":"IF(AD382=\"\",\"\",COUNTIF(AD:AD,AD382))","v":""},null,null,null,null,null,null,null,{"$f":"IF(OR(AE382=\"\",AH382=\"\",AI382=\"\"),\"\",IF(AH382=\"part time\",\"\",AI382-AH382))","v":""}]
[null,null,null,null,null,null,null,null,null,null,null,null,null,null,null,null,null,null,null,null,null,null,null,null,null,{"$f":"IF(AB383=\"\",\"Z\",AB383)","v":"Z"}," ",{"$f":"IF(ISERROR(VLOOKUP(AD383,$AV$14:$AW$87,2)),\"\",VLOOKUP(AD383,$AV$14:$AW$87,2))","v":""},{"$f":"IF(AD383=\"\",\"\",COUNTIF(AD:AD,AD383))","v":""},null,null,null,null,null,null,null,{"$f":"IF(OR(AE383=\"\",AH383=\"\",AI383=\"\"),\"\",IF(AH383=\"part time\",\"\",AI383-AH383))","v":""}]
[null,null,null,null,null,null,null,null,null,null,null,null,null,null,null,null,null,null,null,null,null,null,null,null,null,{"$f":"IF(AB384=\"\",\"Z\",AB384)","v":"Z"}," ",{"$f":"IF(ISERROR(VLOOKUP(AD384,$AV$14:$AW$87,2)),\"\",VLOOKUP(AD384,$AV$14:$AW$87,2))","v":""},{"$f":"IF(AD384=\"\",\"\",COUNTIF(AD:AD,AD384))","v":""},null,null,null,null,null,null,null,{"$f":"IF(OR(AE384=\"\",AH384=\"\",AI384=\"\"),\"\",IF(AH384=\"part time\",\"\",AI384-AH384))","v":""}]
[null,null,null,null,null,null,null,null,null,null,null,null,null,null,null,null,null,null,null,null,null,null,null,null,null,{"$f":"IF(AB385=\"\",\"Z\",AB385)","v":"Z"}," ",{"$f":"IF(ISERROR(VLOOKUP(AD385,$AV$14:$AW$87,2)),\"\",VLOOKUP(AD385,$AV$14:$AW$87,2))","v":""},{"$f":"IF(AD385=\"\",\"\",COUNTIF(AD:AD,AD385))","v":""},null,null,null,null,null,null,null,{"$f":"IF(OR(AE385=\"\",AH385=\"\",AI385=\"\"),\"\",IF(AH385=\"part time\",\"\",AI385-AH385))","v":""}]
[null,null,null,null,null,null,null,null,null,null,null,null,null,null,null,null,null,null,null,null,null,null,null,null,null,{"$f":"IF(AB386=\"\",\"Z\",AB386)","v":"Z"}," ",{"$f":"IF(ISERROR(VLOOKUP(AD386,$AV$14:$AW$87,2)),\"\",VLOOKUP(AD386,$AV$14:$AW$87,2))","v":""},{"$f":"IF(AD386=\"\",\"\",COUNTIF(AD:AD,AD386))","v":""},null,null,null,null,null,null,null,{"$f":"IF(OR(AE386=\"\",AH386=\"\",AI386=\"\"),\"\",IF(AH386=\"part time\",\"\",AI386-AH386))","v":""}]
[null,null,null,null,null,null,null,null,null,null,null,null,null,null,null,null,null,null,null,null,null,null,null,null,null,{"$f":"IF(AB387=\"\",\"Z\",AB387)","v":"Z"}," ",{"$f":"IF(ISERROR(VLOOKUP(AD387,$AV$14:$AW$87,2)),\"\",VLOOKUP(AD387,$AV$14:$AW$87,2))","v":""},{"$f":"IF(AD387=\"\",\"\",COUNTIF(AD:AD,AD387))","v":""},null,null,null,null,null,null,null,{"$f":"IF(OR(AE387=\"\",AH387=\"\",AI387=\"\"),\"\",IF(AH387=\"part time\",\"\",AI387-AH387))","v":""}]
[null,null,null,null,null,null,null,null,null,null,null,null,null,null,null,null,null,null,null,null,null,null,null,null,null,{"$f":"IF(AB388=\"\",\"Z\",AB388)","v":"Z"}," ",{"$f":"IF(ISERROR(VLOOKUP(AD388,$AV$14:$AW$87,2)),\"\",VLOOKUP(AD388,$AV$14:$AW$87,2))","v":""},{"$f":"IF(AD388=\"\",\"\",COUNTIF(AD:AD,AD388))","v":""},null,null,null,null,null,null,null,{"$f":"IF(OR(AE388=\"\",AH388=\"\",AI388=\"\"),\"\",IF(AH388=\"part time\",\"\",AI388-AH388))","v":""}]
[null,null,null,null,null,null,null,null,null,null,null,null,null,null,null,null,null,null,null,null,null,null,null,null,null,{"$f":"IF(AB389=\"\",\"Z\",AB389)","v":"Z"}," ",{"$f":"IF(ISERROR(VLOOKUP(AD389,$AV$14:$AW$87,2)),\"\",VLOOKUP(AD389,$AV$14:$AW$87,2))","v":""},{"$f":"IF(AD389=\"\",\"\",COUNTIF(AD:AD,AD389))","v":""},null,null,null,null,null,null,null,{"$f":"IF(OR(AE389=\"\",AH389=\"\",AI389=\"\"),\"\",IF(AH389=\"part time\",\"\",AI389-AH389))","v":""}]
[null,null,null,null,null,null,null,null,null,null,null,null,null,null,null,null,null,null,null,null,null,null,null,null,null,{"$f":"IF(AB390=\"\",\"Z\",AB390)","v":"Z"}," ",{"$f":"IF(ISERROR(VLOOKUP(AD390,$AV$14:$AW$87,2)),\"\",VLOOKUP(AD390,$AV$14:$AW$87,2))","v":""},{"$f":"IF(AD390=\"\",\"\",COUNTIF(AD:AD,AD390))","v":""},null,null,null,null,null,null,null,{"$f":"IF(OR(AE390=\"\",AH390=\"\",AI390=\"\"),\"\",IF(AH390=\"part time\",\"\",AI390-AH390))","v":""}]
[null,null,null,null,null,null,null,null,null,null,null,null,null,null,null,null,null,null,null,null,null,null,null,null,null,{"$f":"IF(AB391=\"\",\"Z\",AB391)","v":"Z"}," ",{"$f":"IF(ISERROR(VLOOKUP(AD391,$AV$14:$AW$87,2)),\"\",VLOOKUP(AD391,$AV$14:$AW$87,2))","v":""},{"$f":"IF(AD391=\"\",\"\",COUNTIF(AD:AD,AD391))","v":""},null,null,null,null,null,null,null,{"$f":"IF(OR(AE391=\"\",AH391=\"\",AI391=\"\"),\"\",IF(AH391=\"part time\",\"\",AI391-AH391))","v":""}]
[null,null,null,null,null,null,null,null,null,null,null,null,null,null,null,null,null,null,null,null,null,null,null,null,null,{"$f":"IF(AB392=\"\",\"Z\",AB392)","v":"Z"}," ",{"$f":"IF(ISERROR(VLOOKUP(AD392,$AV$14:$AW$87,2)),\"\",VLOOKUP(AD392,$AV$14:$AW$87,2))","v":""},{"$f":"IF(AD392=\"\",\"\",COUNTIF(AD:AD,AD392))","v":""},null,null,null,null,null,null,null,{"$f":"IF(OR(AE392=\"\",AH392=\"\",AI392=\"\"),\"\",IF(AH392=\"part time\",\"\",AI392-AH392))","v":""}]
[null,null,null,null,null,null,null,null,null,null,null,null,null,null,null,null,null,null,null,null,null,null,null,null,null,{"$f":"IF(AB393=\"\",\"Z\",AB393)","v":"Z"}," ",{"$f":"IF(ISERROR(VLOOKUP(AD393,$AV$14:$AW$87,2)),\"\",VLOOKUP(AD393,$AV$14:$AW$87,2))","v":""},{"$f":"IF(AD393=\"\",\"\",COUNTIF(AD:AD,AD393))","v":""},null,null,null,null,null,null,null,{"$f":"IF(OR(AE393=\"\",AH393=\"\",AI393=\"\"),\"\",IF(AH393=\"part time\",\"\",AI393-AH393))","v":""}]
[null,null,null,null,null,null,null,null,null,null,null,null,null,null,null,null,null,null,null,null,null,null,null,null,null,{"$f":"IF(AB394=\"\",\"Z\",AB394)","v":"Z"}," ",{"$f":"IF(ISERROR(VLOOKUP(AD394,$AV$14:$AW$87,2)),\"\",VLOOKUP(AD394,$AV$14:$AW$87,2))","v":""},{"$f":"IF(AD394=\"\",\"\",COUNTIF(AD:AD,AD394))","v":""},null,null,null,null,null,null,null,{"$f":"IF(OR(AE394=\"\",AH394=\"\",AI394=\"\"),\"\",IF(AH394=\"part time\",\"\",AI394-AH394))","v":""}]
[null,null,null,null,null,null,null,null,null,null,null,null,null,null,null,null,null,null,null,null,null,null,null,null,null,{"$f":"IF(AB395=\"\",\"Z\",AB395)","v":"Z"}," ",{"$f":"IF(ISERROR(VLOOKUP(AD395,$AV$14:$AW$87,2)),\"\",VLOOKUP(AD395,$AV$14:$AW$87,2))","v":""},{"$f":"IF(AD395=\"\",\"\",COUNTIF(AD:AD,AD395))","v":""},null,null,null,null,null,null,null,{"$f":"IF(OR(AE395=\"\",AH395=\"\",AI395=\"\"),\"\",IF(AH395=\"part time\",\"\",AI395-AH395))","v":""}]
[null,null,null,null,null,null,null,null,null,null,null,null,null,null,null,null,null,null,null,null,null,null,null,null,null,{"$f":"IF(AB396=\"\",\"Z\",AB396)","v":"Z"}," ",{"$f":"IF(ISERROR(VLOOKUP(AD396,$AV$14:$AW$87,2)),\"\",VLOOKUP(AD396,$AV$14:$AW$87,2))","v":""},{"$f":"IF(AD396=\"\",\"\",COUNTIF(AD:AD,AD396))","v":""},null,null,null,null,null,null,null,{"$f":"IF(OR(AE396=\"\",AH396=\"\",AI396=\"\"),\"\",IF(AH396=\"part time\",\"\",AI396-AH396))","v":""}]
[null,null,null,null,null,null,null,null,null,null,null,null,null,null,null,null,null,null,null,null,null,null,null,null,null,{"$f":"IF(AB397=\"\",\"Z\",AB397)","v":"Z"}," ",{"$f":"IF(ISERROR(VLOOKUP(AD397,$AV$14:$AW$87,2)),\"\",VLOOKUP(AD397,$AV$14:$AW$87,2))","v":""},{"$f":"IF(AD397=\"\",\"\",COUNTIF(AD:AD,AD397))","v":""},null,null,null,null,null,null,null,{"$f":"IF(OR(AE397=\"\",AH397=\"\",AI397=\"\"),\"\",IF(AH397=\"part time\",\"\",AI397-AH397))","v":""}]
[null,null,null,null,null,null,null,null,null,null,null,null,null,null,null,null,null,null,null,null,null,null,null,null,null,{"$f":"IF(AB398=\"\",\"Z\",AB398)","v":"Z"}," ",{"$f":"IF(ISERROR(VLOOKUP(AD398,$AV$14:$AW$87,2)),\"\",VLOOKUP(AD398,$AV$14:$AW$87,2))","v":""},{"$f":"IF(AD398=\"\",\"\",COUNTIF(AD:AD,AD398))","v":""},null,null,null,null,null,null,null,{"$f":"IF(OR(AE398=\"\",AH398=\"\",AI398=\"\"),\"\",IF(AH398=\"part time\",\"\",AI398-AH398))","v":""}]
[null,null,null,null,null,null,null,null,null,null,null,null,null,null,null,null,null,null,null,null,null,null,null,null,null,{"$f":"IF(AB399=\"\",\"Z\",AB399)","v":"Z"}," ",{"$f":"IF(ISERROR(VLOOKUP(AD399,$AV$14:$AW$87,2)),\"\",VLOOKUP(AD399,$AV$14:$AW$87,2))","v":""},{"$f":"IF(AD399=\"\",\"\",COUNTIF(AD:AD,AD399))","v":""},null,null,null,null,null,null,null,{"$f":"IF(OR(AE399=\"\",AH399=\"\",AI399=\"\"),\"\",IF(AH399=\"part time\",\"\",AI399-AH399))","v":""}]
[null,null,null,null,null,null,null,null,null,null,null,null,null,null,null,null,null,null,null,null,null,null,null,null,null,{"$f":"IF(AB400=\"\",\"Z\",AB400)","v":"Z"}," ",{"$f":"IF(ISERROR(VLOOKUP(AD400,$AV$14:$AW$87,2)),\"\",VLOOKUP(AD400,$AV$14:$AW$87,2))","v":""},{"$f":"IF(AD400=\"\",\"\",COUNTIF(AD:AD,AD400))","v":""},null,null,null,null,null,null,null,{"$f":"IF(OR(AE400=\"\",AH400=\"\",AI400=\"\"),\"\",IF(AH400=\"part time\",\"\",AI400-AH400))","v":""}]
[null,null,null,null,null,null,null,null,null,null,null,null,null,null,null,null,null,null,null,null,null,null,null,null,null,{"$f":"IF(AB401=\"\",\"Z\",AB401)","v":"Z"}," ",{"$f":"IF(ISERROR(VLOOKUP(AD401,$AV$14:$AW$87,2)),\"\",VLOOKUP(AD401,$AV$14:$AW$87,2))","v":""},{"$f":"IF(AD401=\"\",\"\",COUNTIF(AD:AD,AD401))","v":""},null,null,null,null,null,null,null,{"$f":"IF(OR(AE401=\"\",AH401=\"\",AI401=\"\"),\"\",IF(AH401=\"part time\",\"\",AI401-AH401))","v":""}]
[null,null,null,null,null,null,null,null,null,null,null,null,null,null,null,null,null,null,null,null,null,null,null,null,null,{"$f":"IF(AB402=\"\",\"Z\",AB402)","v":"Z"}," ",{"$f":"IF(ISERROR(VLOOKUP(AD402,$AV$14:$AW$87,2)),\"\",VLOOKUP(AD402,$AV$14:$AW$87,2))","v":""},{"$f":"IF(AD402=\"\",\"\",COUNTIF(AD:AD,AD402))","v":""},null,null,null,null,null,null,null,{"$f":"IF(OR(AE402=\"\",AH402=\"\",AI402=\"\"),\"\",IF(AH402=\"part time\",\"\",AI402-AH402))","v":""}]
[null,null,null,null,null,null,null,null,null,null,null,null,null,null,null,null,null,null,null,null,null,null,null,null,null,{"$f":"IF(AB403=\"\",\"Z\",AB403)","v":"Z"}," ",{"$f":"IF(ISERROR(VLOOKUP(AD403,$AV$14:$AW$87,2)),\"\",VLOOKUP(AD403,$AV$14:$AW$87,2))","v":""},{"$f":"IF(AD403=\"\",\"\",COUNTIF(AD:AD,AD403))","v":""},null,null,null,null,null,null,null,{"$f":"IF(OR(AE403=\"\",AH403=\"\",AI403=\"\"),\"\",IF(AH403=\"part time\",\"\",AI403-AH403))","v":""}]
[null,null,null,null,null,null,null,null,null,null,null,null,null,null,null,null,null,null,null,null,null,null,null,null,null,{"$f":"IF(AB404=\"\",\"Z\",AB404)","v":"Z"}," ",{"$f":"IF(ISERROR(VLOOKUP(AD404,$AV$14:$AW$87,2)),\"\",VLOOKUP(AD404,$AV$14:$AW$87,2))","v":""},{"$f":"IF(AD404=\"\",\"\",COUNTIF(AD:AD,AD404))","v":""},null,null,null,null,null,null,null,{"$f":"IF(OR(AE404=\"\",AH404=\"\",AI404=\"\"),\"\",IF(AH404=\"part time\",\"\",AI404-AH404))","v":""}]
[null,null,null,null,null,null,null,null,null,null,null,null,null,null,null,null,null,null,null,null,null,null,null,null,null,{"$f":"IF(AB405=\"\",\"Z\",AB405)","v":"Z"}," ",{"$f":"IF(ISERROR(VLOOKUP(AD405,$AV$14:$AW$87,2)),\"\",VLOOKUP(AD405,$AV$14:$AW$87,2))","v":""},{"$f":"IF(AD405=\"\",\"\",COUNTIF(AD:AD,AD405))","v":""},null,null,null,null,null,null,null,{"$f":"IF(OR(AE405=\"\",AH405=\"\",AI405=\"\"),\"\",IF(AH405=\"part time\",\"\",AI405-AH405))","v":""}]
[null,null,null,null,null,null,null,null,null,null,null,null,null,null,null,null,null,null,null,null,null,null,null,null,null,{"$f":"IF(AB406=\"\",\"Z\",AB406)","v":"Z"}," ",{"$f":"IF(ISERROR(VLOOKUP(AD406,$AV$14:$AW$87,2)),\"\",VLOOKUP(AD406,$AV$14:$AW$87,2))","v":""},{"$f":"IF(AD406=\"\",\"\",COUNTIF(AD:AD,AD406))","v":""},null,null,null,null,null,null,null,{"$f":"IF(OR(AE406=\"\",AH406=\"\",AI406=\"\"),\"\",IF(AH406=\"part time\",\"\",AI406-AH406))","v":""}]
[null,null,null,null,null,null,null,null,null,null,null,null,null,null,null,null,null,null,null,null,null,null,null,null,null,{"$f":"IF(AB407=\"\",\"Z\",AB407)","v":"Z"}," ",{"$f":"IF(ISERROR(VLOOKUP(AD407,$AV$14:$AW$87,2)),\"\",VLOOKUP(AD407,$AV$14:$AW$87,2))","v":""},{"$f":"IF(AD407=\"\",\"\",COUNTIF(AD:AD,AD407))","v":""},null,null,null,null,null,null,null,{"$f":"IF(OR(AE407=\"\",AH407=\"\",AI407=\"\"),\"\",IF(AH407=\"part time\",\"\",AI407-AH407))","v":""}]
[null,null,null,null,null,null,null,null,null,null,null,null,null,null,null,null,null,null,null,null,null,null,null,null,null,{"$f":"IF(AB408=\"\",\"Z\",AB408)","v":"Z"}," ",{"$f":"IF(ISERROR(VLOOKUP(AD408,$AV$14:$AW$87,2)),\"\",VLOOKUP(AD408,$AV$14:$AW$87,2))","v":""},{"$f":"IF(AD408=\"\",\"\",COUNTIF(AD:AD,AD408))","v":""},null,null,null,null,null,null,null,{"$f":"IF(OR(AE408=\"\",AH408=\"\",AI408=\"\"),\"\",IF(AH408=\"part time\",\"\",AI408-AH408))","v":""}]
[null,null,null,null,null,null,null,null,null,null,null,null,null,null,null,null,null,null,null,null,null,null,null,null,null,{"$f":"IF(AB409=\"\",\"Z\",AB409)","v":"Z"}," ",{"$f":"IF(ISERROR(VLOOKUP(AD409,$AV$14:$AW$87,2)),\"\",VLOOKUP(AD409,$AV$14:$AW$87,2))","v":""},{"$f":"IF(AD409=\"\",\"\",COUNTIF(AD:AD,AD409))","v":""},null,null,null,null,null,null,null,{"$f":"IF(OR(AE409=\"\",AH409=\"\",AI409=\"\"),\"\",IF(AH409=\"part time\",\"\",AI409-AH409))","v":""}]
[null,null,null,null,null,null,null,null,null,null,null,null,null,null,null,null,null,null,null,null,null,null,null,null,null,{"$f":"IF(AB410=\"\",\"Z\",AB410)","v":"Z"}," ",{"$f":"IF(ISERROR(VLOOKUP(AD410,$AV$14:$AW$87,2)),\"\",VLOOKUP(AD410,$AV$14:$AW$87,2))","v":""},{"$f":"IF(AD410=\"\",\"\",COUNTIF(AD:AD,AD410))","v":""},null,null,null,null,null,null,null,{"$f":"IF(OR(AE410=\"\",AH410=\"\",AI410=\"\"),\"\",IF(AH410=\"part time\",\"\",AI410-AH410))","v":""}]
[null,null,null,null,null,null,null,null,null,null,null,null,null,null,null,null,null,null,null,null,null,null,null,null,null,{"$f":"IF(AB411=\"\",\"Z\",AB411)","v":"Z"}," ",{"$f":"IF(ISERROR(VLOOKUP(AD411,$AV$14:$AW$87,2)),\"\",VLOOKUP(AD411,$AV$14:$AW$87,2))","v":""},{"$f":"IF(AD411=\"\",\"\",COUNTIF(AD:AD,AD411))","v":""},null,null,null,null,null,null,null,{"$f":"IF(OR(AE411=\"\",AH411=\"\",AI411=\"\"),\"\",IF(AH411=\"part time\",\"\",AI411-AH411))","v":""}]
[null,null,null,null,null,null,null,null,null,null,null,null,null,null,null,null,null,null,null,null,null,null,null,null,null,{"$f":"IF(AB412=\"\",\"Z\",AB412)","v":"Z"}," ",{"$f":"IF(ISERROR(VLOOKUP(AD412,$AV$14:$AW$87,2)),\"\",VLOOKUP(AD412,$AV$14:$AW$87,2))","v":""},{"$f":"IF(AD412=\"\",\"\",COUNTIF(AD:AD,AD412))","v":""},null,null,null,null,null,null,null,{"$f":"IF(OR(AE412=\"\",AH412=\"\",AI412=\"\"),\"\",IF(AH412=\"part time\",\"\",AI412-AH412))","v":""}]
[null,null,null,null,null,null,null,null,null,null,null,null,null,null,null,null,null,null,null,null,null,null,null,null,null,{"$f":"IF(AB413=\"\",\"Z\",AB413)","v":"Z"}," ",{"$f":"IF(ISERROR(VLOOKUP(AD413,$AV$14:$AW$87,2)),\"\",VLOOKUP(AD413,$AV$14:$AW$87,2))","v":""},{"$f":"IF(AD413=\"\",\"\",COUNTIF(AD:AD,AD413))","v":""},null,null,null,null,null,null,null,{"$f":"IF(OR(AE413=\"\",AH413=\"\",AI413=\"\"),\"\",IF(AH413=\"part time\",\"\",AI413-AH413))","v":""}]
[null,null,null,null,null,null,null,null,null,null,null,null,null,null,null,null,null,null,null,null,null,null,null,null,null,{"$f":"IF(AB414=\"\",\"Z\",AB414)","v":"Z"}," ",{"$f":"IF(ISERROR(VLOOKUP(AD414,$AV$14:$AW$87,2)),\"\",VLOOKUP(AD414,$AV$14:$AW$87,2))","v":""},{"$f":"IF(AD414=\"\",\"\",COUNTIF(AD:AD,AD414))","v":""},null,null,null,null,null,null,null,{"$f":"IF(OR(AE414=\"\",AH414=\"\",AI414=\"\"),\"\",IF(AH414=\"part time\",\"\",AI414-AH414))","v":""}]
[null,null,null,null,null,null,null,null,null,null,null,null,null,null,null,null,null,null,null,null,null,null,null,null,null,null,null,"Formulas",null,null,"KØPC Sourced Data (CSV file)"]

{"sheet":"Calc ETA","index":1,"n_rows":34,"n_cols":11,"rows_kept":34,"cut":false,"hidden":false,"merged":[[14,8,33,10],[12,8,12,10],[1,3,2,3],[1,1,2,1],[1,5,2,5],[1,6,2,6],[1,2,2,2],[1,8,2,10]]}
[]
[null,"Start","End","Sequence","Duration","Begin","End",null,"Calculate Averate County Duration"]
[null,null,null,null,"hh:mm:ss"]
[null,{"$f":"J5","v":0.54166666666666663},{"$f":"B4+$J$11","v":0.5641025641025641},1,{"$f":"$J$11","v":"00:32:18.462"},{"$f":"TEXT(B4,\"hhmm\")","v":"1300"},{"$f":"TEXT(B5,\"hhmm\")","v":"1332"}]
[null,{"$f":"B4+$J$11","v":0.5641025641025641},{"$f":"B5+$J$11","v":0.58653846153846156},2,null,"1332","1404",null,"Enter the operating start time:","13:00:00","CDT"]
[null,{"$f":"B5+$J$11","v":0.58653846153846156},0.60897435897435903,3,null,"1404","1436"]
[null,0.60897435897435903,0.6314102564102565,4,null,"1436","1509",null,"Enter the contest duration in minutes:",420]
[null,0.6314102564102565,0.65384615384615397,5,null,"1509","1541"]
[null,0.65384615384615397,0.67628205128205143,6,null,"1541","1613",null,"Enter the number of counties visited:",13]
[null,0.67628205128205143,0.6987179487179489,7,null,"1613","1646"]
[null,0.6987179487179489,0.72115384615384637,8,null,"1646","1718",null,"This is the average duration:",{"$f":"TIME((J7/60),0,0)/J9","v":"00:32:18.462"},"hh:mm:ss"]
[null,0.72115384615384637,0.74358974358974383,9,null,"1718","1750"]
[null,0.74358974358974383,0.7660256410256413,10,null,"1750","1823",null,"Enter the appropriate values into the yellow cells"]
[null,0.7660256410256413,0.78846153846153877,11,null,"1823","1855"]
[null,0.78846153846153877,0.81089743589743624,12,null,"1855","1927",null,"OVERVIEW:\n\nThis worksheet is used to generate the start and end times for each county for mobile operators. Verify the appropriate values into the yellow highlighted cells above.The table to the left will automatically generate the estimated mobile start and end times for each county in columns C and D. The equivalent TEXT values are generated in columns F and G.\n\nNOTES: \n\nCell J5 and J7 are prefilled for the MnQP but these can be changed to accommodate other QSO Parties.\n\nThe aqua highlighted cells in the table represent the values calculated from your input. Disregard the non-colored cells below the highlighted area.\n\nCopy (values) the aqua colored cells from columns B, C, and D to the MnQP worksheet as appropriate."]
[null,0.81089743589743624,0.8333333333333337,13,null,"1927","2000"]
[null,0.8333333333333337,0.85576923076923117,14,null,"2000","2032"]
[null,0.85576923076923117,0.87820512820512864,15,null,"2032","2104"]
[null,0.87820512820512864,0.90064102564102611,16,null,"2104","2136"]
[null,0.90064102564102611,0.92307692307692357,17,null,"2136","2209"]
[null,0.92307692307692357,0.94551282051282104,18,null,"2209","2241"]
[null,0.94551282051282104,0.96794871794871851,19,null,"2241","2313"]
[null,0.96794871794871851,0.99038461538461597,20,null,"2313","2346"]
[null,0.99038461538461597,1.0128205128205134,21,null,"2346","0018"]
[null,1.0128205128205134,1.0352564102564108,22,null,"0018","0050"]
[null,1.0352564102564108,1.0576923076923082,23,null,"0050","0123"]
[null,1.0576923076923082,1.0801282051282055,24,null,"0123","0155"]
[null,1.0801282051282055,1.1025641025641029,25,null,"0155","0227"]
[null,1.1025641025641029,1.1250000000000002,26,null,"0227","0300"]
[null,1.1250000000000002,1.1474358974358976,27,null,"0300","0332"]
[null,1.1474358974358976,1.1698717948717949,28,null,"0332","0404"]
[null,1.1698717948717949,1.1923076923076923,29,null,"0404","0436"]
[null,1.1923076923076923,1.2147435897435896,30,null,"0436","0509"]
[null,1.2147435897435896,1.237179487179487,31,null,"0509"]

{"sheet":"Data","index":2,"n_rows":302,"n_cols":17,"rows_kept":302,"cut":false,"hidden":false,"merged":[[0,0,0,6],[0,8,0,14],[0,7,1,7]]}
["Import K0PC csv file and paste the TEXT values here",null,null,null,null,null,null,"K0PC Rev 28 \n2/4/2022","Copy these columns into the \"YYYY MnQP\" worksheet as VALUES",null,null,null,null,null,null,null,"Rows"]
["CTY","CALL","F/M/R","MODES","START","FINISH","SEQ",null,"CTY","CALL","F/M/R","MODES","START","FINISH","SEQ",null,{"$f":"COUNTIF(A:A,\">\"\"\")-2","v":210}]
["LES","AA0EE","FIXED","PH/CW",1400,2400,1,null,{"$f":"IF(A3=\"\",\"\",A3)","v":"LES"},{"$f":"IF(B3=\"\",\"\",B3)","v":"AA0EE"},{"$f":"IF(C3=\"\",\"\",C3)","v":"FIXED"},{"$f":"IF(D3=\"\",\"\",D3)","v":"PH/CW"},{"$f":"IF(E3=\"TBD\",\"TBD\",IF(E3=\"part time\",\"part time\",IF(ISBLANK(E3),\"\",TIMEVALUE(LEFT(E3,LEN(E3)-2)&\":\"&RIGHT(E3,2)))))","v":0.58333333333333337},{"$f":"IF(F3=2400,\"24:00\",IF(ISBLANK(F3),\"\",TIMEVALUE(LEFT(F3,LEN(F3)-2)&\":\"&RIGHT(F3,2))))","v":"24:00"},{"$f":"IF(G3=\"\",\"\",G3)","v":1}]
["CLA","AC0W","MOBILE","PH/CW",1400,1443,1,null,"CLA","AC0W","MOBILE","PH/CW",0.58333333333333337,0.61319444444444449,1]
["NOR","AC0W","MOBILE","PH/CW",1443,1517,2,null,"NOR","AC0W","MOBILE","PH/CW",0.61319444444444449,0.63680555555555551,2]
["MAH","AC0W","MOBILE","PH/CW",1517,1541,3,null,"MAH","AC0W","MOBILE","PH/CW",0.63680555555555551,0.65347222222222223,3]
["CLE","AC0W","MOBILE","PH/CW",1541,1603,4,null,"CLE","AC0W","MOBILE","PH/CW",0.65347222222222223,0.66874999999999996,4]
["HUB","AC0W","MOBILE","PH/CW",1603,1636,5,null,"HUB","AC0W","MOBILE","PH/CW",0.66874999999999996,0.69166666666666665,5]
["BEL","AC0W","MOBILE","PH/CW",1636,1721,6,null,"BEL","AC0W","MOBILE","PH/CW",0.69166666666666665,0.72291666666666665,6]
["CLE","AC0W","MOBILE","PH/CW",1721,1738,7,null,"CLE","AC0W","MOBILE","PH/CW",0.72291666666666665,0.73472222222222228,7]
["POL","AC0W","MOBILE","PH/CW",1738,1806,8,null,"POL","AC0W","MOBILE","PH/CW",0.73472222222222228,0.75416666666666665,8]
["RDL","AC0W","MOBILE","PH/CW",1806,1837,9,null,"RDL","AC0W","MOBILE","PH/CW",0.75416666666666665,0.77569444444444446,9]
["PEN","AC0W","MOBILE","PH/CW",1837,1936,10,null,"PEN","AC0W","MOBILE","PH/CW",0.77569444444444446,0.81666666666666665,10]
["MRS","AC0W","MOBILE","PH/CW",1936,2018,11,null,"MRS","AC0W","MOBILE","PH/CW",0.81666666666666665,0.84583333333333333,11]
["KIT","AC0W","MOBILE","PH/CW",2018,2200,12,null,"KIT","AC0W","MOBILE","PH/CW",0.84583333333333333,0.91666666666666663,12]
["ROS","AC0W","MOBILE","PH/CW",2200,2214,13,null,"ROS","AC0W","MOBILE","PH/CW",0.91666666666666663,0.92638888888888893,13]
["LKW","AC0W","MOBILE","PH/CW",2214,2248,14,null,"LKW","AC0W","MOBILE","PH/CW",0.92638888888888893,0.95,14]
["KOO","AC0W","MOBILE","PH/CW",2248,2400,15,null,"KOO","AC0W","MOBILE","PH/CW",0.95,"24:00",15]
["HEN","K0AD","FIXED","PH/CW",1400,2400,1,null,"HEN","K0AD","FIXED","PH/CW",0.58333333333333337,"24:00",1]
["LES","K0APR","FIXED","PH/CW",1400,2400,1,null,"LES","K0APR","FIXED","PH/CW",0.58333333333333337,"24:00",1]
["STR","K0ARF","FIXED","PH/CW",1400,2400,1,null,"STR","K0ARF","FIXED","PH/CW",0.58333333333333337,"24:00",1]
["ROC","K0BBC","MOBILE","PH",1400,1435,1,null,"ROC","K0BBC","MOBILE","PH",0.58333333333333337,0.60763888888888884,1]
["PIP","K0BBC","MOBILE","PH",1435,1510,2,null,"PIP","K0BBC","MOBILE","PH",0.60763888888888884,0.63194444444444442,2]
["MUR","K0BBC","MOBILE","PH",1510,1545,3,null,"MUR","K0BBC","MOBILE","PH",0.63194444444444442,0.65625,3]
["LYO","K0BBC","MOBILE","PH",1545,1620,4,null,"LYO","K0BBC","MOBILE","PH",0.65625,0.68055555555555558,4]
["LIN","K0BBC","MOBILE","PH",1620,1655,5,null,"LIN","K0BBC","MOBILE","PH",0.68055555555555558,0.70486111111111116,5]
["YEL","K0BBC","MOBILE","PH",1655,1730,6,null,"YEL","K0BBC","MOBILE","PH",0.70486111111111116,0.72916666666666663,6]
["LAC","K0BBC","MOBILE","PH",1730,1805,7,null,"LAC","K0BBC","MOBILE","PH",0.72916666666666663,0.75347222222222221,7]
["YEL","K0BBC","MOBILE","PH",1805,1840,8,null,"YEL","K0BBC","MOBILE","PH",0.75347222222222221,0.77777777777777779,8]
["RDW","K0BBC","MOBILE","PH",1840,1915,9,null,"RDW","K0BBC","MOBILE","PH",0.77777777777777779,0.80208333333333337,9]
["BRO","K0BBC","MOBILE","PH",1915,1950,10,null,"BRO","K0BBC","MOBILE","PH",0.80208333333333337,0.82638888888888884,10]
["WAT","K0BBC","MOBILE","PH",1950,2025,11,null,"WAT","K0BBC","MOBILE","PH",0.82638888888888884,0.85069444444444442,11]
["BLU","K0BBC","MOBILE","PH",2025,2100,12,null,"BLU","K0BBC","MOBILE","PH",0.85069444444444442,0.875,12]
["FAI","K0BBC","MOBILE","PH",2100,2135,13,null,"FAI","K0BBC","MOBILE","PH",0.875,0.89930555555555558,13]
["MRT","K0BBC","MOBILE","PH",2135,2210,14,null,"MRT","K0BBC","MOBILE","PH",0.89930555555555558,0.92361111111111116,14]
["JAC","K0BBC","MOBILE","PH",2210,2245,15,null,"JAC","K0BBC","MOBILE","PH",0.92361111111111116,0.94791666666666663,15]
["NOB","K0BBC","MOBILE","PH",2245,2320,16,null,"NOB","K0BBC","MOBILE","PH",0.94791666666666663,0.97222222222222221,16]
["ROC","K0BBC","MOBILE","PH",2320,2400,17,null,"ROC","K0BBC","MOBILE","PH",0.97222222222222221,"24:00",17]
["LAK","K0EKL","MOBILE","PH/CW",1800,2000,1,null,"LAK","K0EKL","MOBILE","PH/CW",0.75,0.83333333333333337,1]
["WSH","K0FVF","FIXED","PH/CW",1400,2400,1,null,"WSH","K0FVF","FIXED","PH/CW",0.58333333333333337,"24:00",1]
["OLM","K0GMK","FIXED","PH/CW",1400,2400,1,null,"OLM","K0GMK","FIXED","PH/CW",0.58333333333333337,"24:00",1]
["OLM","K0GMK","FIXED","PH/CW",1400,2400,1,null,"OLM","K0GMK","FIXED","PH/CW",0.58333333333333337,"24:00",1]
["WSH","K0GW","FIXED","PH/CW",1400,2400,1,null,"WSH","K0GW","FIXED","PH/CW",0.58333333333333337,"24:00",1]
["HEN","K0HB","FIXED","PH/CW",1400,2400,1,null,"HEN","K0HB","FIXED","PH/CW",0.58333333333333337,"24:00",1]
["STL","K0JJR","FIXED","PH/CW",1400,2400,1,null,"STL","K0JJR","FIXED","PH/CW",0.58333333333333337,"24:00",1]
["CRL","K0LD","MOBILE","CW",1400,1425,1,null,"CRL","K0LD","MOBILE","CW",0.58333333333333337,0.60069444444444442,1]
["PIN","K0LD","MOBILE","CW",1435,1455,2,null,"PIN","K0LD","MOBILE","CW",0.60763888888888884,0.62152777777777779,2]
["AIT","K0LD","MOBILE","CW",1510,1540,3,null,"AIT","K0LD","MOBILE","CW",0.63194444444444442,0.65277777777777779,3]
["KNB","K0LD","MOBILE","CW",1600,1630,4,null,"KNB","K0LD","MOBILE","CW",0.66666666666666663,0.6875,4]
["MIL","K0LD","MOBILE","CW",1640,1710,5,null,"MIL","K0LD","MOBILE","CW",0.69444444444444442,0.71527777777777779,5]
["BEN","K0LD","MOBILE","CW",1730,1750,6,null,"BEN","K0LD","MOBILE","CW",0.72916666666666663,0.74305555555555558,6]
["SHE","K0LD","MOBILE","CW",1815,1840,7,null,"SHE","K0LD","MOBILE","CW",0.76041666666666663,0.77777777777777779,7]
["ISA","K0LD","MOBILE","CW",1900,1925,8,null,"ISA","K0LD","MOBILE","CW",0.79166666666666663,0.80902777777777779,8]
["CHS","K0LD","MOBILE","CW",1945,2010,9,null,"CHS","K0LD","MOBILE","CW",0.82291666666666663,0.84027777777777779,9]
["WSH","K0LD","MOBILE","CW",2030,2100,10,null,"WSH","K0LD","MOBILE","CW",0.85416666666666663,0.875,10]
["DOD","K0MD","MOBILE","PH/CW",1400,1415,1,null,"DOD","K0MD","MOBILE","PH/CW",0.58333333333333337,0.59375,1]
["MOW","K0MD","MOBILE","PH/CW",1415,1430,2,null,"MOW","K0MD","MOBILE","PH/CW",0.59375,0.60416666666666663,2]
["FRE","K0MD","MOBILE","PH/CW",1430,1500,3,null,"FRE","K0MD","MOBILE","PH/CW",0.60416666666666663,0.625,3]
["STE","K0MD","MOBILE","PH/CW",1500,1515,4,null,"STE","K0MD","MOBILE","PH/CW",0.625,0.63541666666666663,4]
["WSC","K0MD","MOBILE","PH/CW",1515,1545,5,null,"WSC","K0MD","MOBILE","PH/CW",0.63541666666666663,0.65625,5]
["BLU","K0MD","MOBILE","PH/CW",1545,1600,6,null,"BLU","K0MD","MOBILE","PH/CW",0.65625,0.66666666666666663,6]
["FAI","K0MD","MOBILE","PH/CW",1600,1645,7,null,"FAI","K0MD","MOBILE","PH/CW",0.66666666666666663,0.69791666666666663,7]
["MRT","K0MD","MOBILE","PH/CW",1645,1730,8,null,"MRT","K0MD","MOBILE","PH/CW",0.69791666666666663,0.72916666666666663,8]
["JAC","K0MD","MOBILE","PH/CW",1730,1810,9,null,"JAC","K0MD","MOBILE","PH/CW",0.72916666666666663,0.75694444444444442,9]
["NOB","K0MD","MOBILE","PH/CW",1810,1850,10,null,"NOB","K0MD","MOBILE","PH/CW",0.75694444444444442,0.78472222222222221,10]
["ROC","K0MD","MOBILE","PH/CW",1850,1920,11,null,"ROC","K0MD","MOBILE","PH/CW",0.78472222222222221,0.80555555555555558,11]
["PIP","K0MD","MOBILE","PH/CW",1920,1955,12,null,{"$f":"IF(A67=\"\",\"\",A67)","v":"PIP"},{"$f":"IF(B67=\"\",\"\",B67)","v":"K0MD"},{"$f":"IF(C67=\"\",\"\",C67)","v":"MOBILE"},{"$f":"IF(D67=\"\",\"\",D67)","v":"PH/CW"},{"$f":"IF(E67=\"TBD\",\"TBD\",IF(E67=\"part time\",\"part time\",IF(ISBLANK(E67),\"\",TIMEVALUE(LEFT(E67,LEN(E67)-2)&\":\"&RIGHT(E67,2)))))","v":0.80555555555555558},{"$f":"IF(F67=2400,\"24:00\",IF(ISBLANK(F67),\"\",TIMEVALUE(LEFT(F67,LEN(F67)-2)&\":\"&RIGHT(F67,2))))","v":0.82986111111111116},{"$f":"IF(G67=\"\",\"\",G67)","v":12}]
["LIN","K0MD","MOBILE","PH/CW",1955,2010,13,null,"LIN","K0MD","MOBILE","PH/CW",0.82986111111111116,0.84027777777777779,13]
["LYO","K0MD","MOBILE","PH/CW",2010,2045,14,null,"LYO","K0MD","MOBILE","PH/CW",0.84027777777777779,0.86458333333333337,14]
["RDW","K0MD","MOBILE","PH/CW",2045,2145,15,null,"RDW","K0MD","MOBILE","PH/CW",0.86458333333333337,0.90625,15]
["COT","K0MD","MOBILE","PH/CW",2145,2200,16,null,"COT","K0MD","MOBILE","PH/CW",0.90625,0.91666666666666663,16]
["WAT","K0MD","MOBILE","PH/CW",2200,2250,17,null,"WAT","K0MD","MOBILE","PH/CW",0.91666666666666663,0.95138888888888884,17]
["MRT","K0MD","MOBILE","PH/CW",2250,2325,18,null,"MRT","K0MD","MOBILE","PH/CW",0.95138888888888884,0.97569444444444442,18]
["FAI","K0MD","MOBILE","PH/CW",2325,2400,19,null,"FAI","K0MD","MOBILE","PH/CW",0.97569444444444442,"24:00",19]
["STR","K0MPH","FIXED","PH/CW",1400,1900,1,null,"STR","K0MPH","FIXED","PH/CW",0.58333333333333337,0.79166666666666663,1]
["HEN","K0MPH","FIXED","PH/CW",1900,2400,1,null,"HEN","K0MPH","FIXED","PH/CW",0.79166666666666663,"24:00",1]
["HEN","K0NOC","FIXED","PH/CW",1400,2400,1,null,"HEN","K0NOC","FIXED","PH/CW",0.58333333333333337,"24:00",1]
["WRI","K0PC","MOBILE","CW",1400,1430,1,null,"WRI","K0PC","MOBILE","CW",0.58333333333333337,0.60416666666666663,1]
["MEE","K0PC","MOBILE","CW",1430,1500,2,null,"MEE","K0PC","MOBILE","CW",0.60416666666666663,0.625,2]
["KND","K0PC","MOBILE","CW",1500,1545,3,null,"KND","K0PC","MOBILE","CW",0.625,0.65625,3]
["STR","K0PC","MOBILE","CW",1545,1555,4,null,"STR","K0PC","MOBILE","CW",0.65625,0.66319444444444442,4]
["POP","K0PC","MOBILE","CW",1555,1610,5,null,"POP","K0PC","MOBILE","CW",0.66319444444444442,0.67361111111111116,5]
["DOU","K0PC","MOBILE","CW",1610,1635,6,null,"DOU","K0PC","MOBILE","CW",0.67361111111111116,0.69097222222222221,6]
["GRA","K0PC","MOBILE","CW",1635,1700,7,null,"GRA","K0PC","MOBILE","CW",0.69097222222222221,0.70833333333333337,7]
["OTT","K0PC","MOBILE","CW",1700,1745,8,null,"OTT","K0PC","MOBILE","CW",0.70833333333333337,0.73958333333333337,8]
["WIL","K0PC","MOBILE","CW",1745,1825,9,null,"WIL","K0PC","MOBILE","CW",0.73958333333333337,0.76736111111111116,9]
["TRA","K0PC","MOBILE","CW",1825,1900,10,null,"TRA","K0PC","MOBILE","CW",0.76736111111111116,0.79166666666666663,10]
["BIG","K0PC","MOBILE","CW",1900,1930,11,null,"BIG","K0PC","MOBILE","CW",0.79166666666666663,0.8125,11]
["STV","K0PC","MOBILE","CW",1930,2000,12,null,"STV","K0PC","MOBILE","CW",0.8125,0.83333333333333337,12]
["SWI","K0PC","MOBILE","CW",2000,2025,13,null,"SWI","K0PC","MOBILE","CW",0.83333333333333337,0.85069444444444442,13]
["CHP","K0PC","MOBILE","CW",2025,2115,14,null,"CHP","K0PC","MOBILE","CW",0.85069444444444442,0.88541666666666663,14]
["REN","K0PC","MOBILE","CW",2115,2215,15,null,"REN","K0PC","MOBILE","CW",0.88541666666666663,0.92708333333333337,15]
["SIB","K0PC","MOBILE","CW",2215,2150,16,null,"SIB","K0PC","MOBILE","CW",0.92708333333333337,0.90972222222222221,16]
["MCL","K0PC","MOBILE","CW",2250,2330,17,null,"MCL","K0PC","MOBILE","CW",0.95138888888888884,0.97916666666666663,17]
["CRV","K0PC","MOBILE","CW",2330,2400,18,null,"CRV","K0PC","MOBILE","CW",0.97916666666666663,"24:00",18]
["ISA","K0QEI","FIXED","PH/CW",1400,2400,1,null,"ISA","K0QEI","FIXED","PH/CW",0.58333333333333337,"24:00",1]
["CHS","K0RC","FIXED","PH/CW",1400,2400,1,null,"CHS","K0RC","FIXED","PH/CW",0.58333333333333337,"24:00",1]
["RAM","K0TC","FIXED","PH/CW",1400,2400,1,null,"RAM","K0TC","FIXED","PH/CW",0.58333333333333337,"24:00",1]
["RAM","K0TG","FIXED","PH/CW",1400,2400,1,null,"RAM","K0TG","FIXED","PH/CW",0.58333333333333337,"24:00",1]
["BLU","K0TJT","FIXED","PH/CW",1400,2400,1,null,"BLU","K0TJT","FIXED","PH/CW",0.58333333333333337,"24:00",1]
["MUR","K0TLG","FIXED","PH/CW/DIG",1400,2400,1,null,"MUR","K0TLG","FIXED","PH/CW/DIG",0.58333333333333337,"24:00",1]
["DAK","K0TT","FIXED","PH/CW",1400,2400,1,null,"DAK","K0TT","FIXED","PH/CW",0.58333333333333337,"24:00",1]
["NIC","K0YR","FIXED","PH/CW",1400,2400,1,null,"NIC","K0YR","FIXED","PH/CW",0.58333333333333337,"24:00",1]
["OLM","K1KD","FIXED","PH/CW",1400,2400,1,null,"OLM","K1KD","FIXED","PH/CW",0.58333333333333337,"24:00",1]
["WSH","K9DU","FIXED","PH/CW",1400,2400,1,null,"WSH","K9DU","FIXED","PH/CW",0.58333333333333337,"24:00",1]
["MEE","KA0CSW","FIXED","PH/CW",1400,2400,1,null,"MEE","KA0CSW","FIXED","PH/CW",0.58333333333333337,"24:00",1]
["STE","KA0PQW","FIXED","PH/CW",1400,2400,1,null,"STE","KA0PQW","FIXED","PH/CW",0.58333333333333337,"24:00",1]
["LES","KB0EO","FIXED","PH/CW",1400,2400,1,null,"LES","KB0EO","FIXED","PH/CW",0.58333333333333337,"24:00",1]
["DAK","KB0NES","FIXED","PH/CW",1400,2400,1,null,"DAK","KB0NES","FIXED","PH/CW",0.58333333333333337,"24:00",1]
["DAK","KB0R","FIXED","PH/CW",1400,2400,1,null,"DAK","KB0R","FIXED","PH/CW",0.58333333333333337,"24:00",1]
["JAC","KC0FOT","FIXED","PH",1400,2400,1,null,"JAC","KC0FOT","FIXED","PH",0.58333333333333337,"24:00",1]
["STL","KC0NFB","FIXED","PH",1400,2400,1,null,"STL","KC0NFB","FIXED","PH",0.58333333333333337,"24:00",1]
["HEN","KC0RET","FIXED","PH/CW",1400,2400,1,null,"HEN","KC0RET","FIXED","PH/CW",0.58333333333333337,"24:00",1]
["HEN","KE0TL","MOBILE","PH/CW",1400,1440,1,null,"HEN","KE0TL","MOBILE","PH/CW",0.58333333333333337,0.61111111111111116,1]
["SCO","KE0TL","MOBILE","PH/CW",1440,1520,2,null,"SCO","KE0TL","MOBILE","PH/CW",0.61111111111111116,0.63888888888888884,2]
["LES","KE0TL","MOBILE","PH/CW",1520,1600,3,null,"LES","KE0TL","MOBILE","PH/CW",0.63888888888888884,0.66666666666666663,3]
["WSC","KE0TL","MOBILE","PH/CW",1600,1640,4,null,"WSC","KE0TL","MOBILE","PH/CW",0.66666666666666663,0.69444444444444442,4]
["FRE","KE0TL","MOBILE","PH/CW",1640,1720,5,null,"FRE","KE0TL","MOBILE","PH/CW",0.69444444444444442,0.72222222222222221,5]
["STE","KE0TL","MOBILE","PH/CW",1720,1800,6,null,"STE","KE0TL","MOBILE","PH/CW",0.72222222222222221,0.75,6]
["DOD","KE0TL","MOBILE","PH/CW",1800,1840,7,null,"DOD","KE0TL","MOBILE","PH/CW",0.75,0.77777777777777779,7]
["MOW","KE0TL","MOBILE","PH/CW",1840,1920,8,null,"MOW","KE0TL","MOBILE","PH/CW",0.77777777777777779,0.80555555555555558,8]
["OLM","KE0TL","MOBILE","PH/CW",1920,2000,9,null,"OLM","KE0TL","MOBILE","PH/CW",0.80555555555555558,0.83333333333333337,9]
["FIL","KE0TL","MOBILE","PH/CW",2000,2040,10,null,"FIL","KE0TL","MOBILE","PH/CW",0.83333333333333337,0.86111111111111116,10]
["HOU","KE0TL","MOBILE","PH/CW",2040,2120,11,null,"HOU","KE0TL","MOBILE","PH/CW",0.86111111111111116,0.88888888888888884,11]
["WIN","KE0TL","MOBILE","PH/CW",2120,2200,12,null,"WIN","KE0TL","MOBILE","PH/CW",0.88888888888888884,0.91666666666666663,12]
["WAB","KE0TL","MOBILE","PH/CW",2200,2240,13,null,"WAB","KE0TL","MOBILE","PH/CW",0.91666666666666663,0.94444444444444442,13]
["GOO","KE0TL","MOBILE","PH/CW",2240,2320,14,null,"GOO","KE0TL","MOBILE","PH/CW",0.94444444444444442,0.97222222222222221,14]
["DAK","KE0TL","MOBILE","PH/CW",2320,2400,15,null,"DAK","KE0TL","MOBILE","PH/CW",0.97222222222222221,"24:00",15]
["OLM","KE0TT","FIXED","CW",1400,2400,1,null,"OLM","KE0TT","FIXED","CW",0.58333333333333337,"24:00",1]
["NOB","KE0WPA","FIXED","PH/CW",1400,2400,1,null,"NOB","KE0WPA","FIXED","PH/CW",0.58333333333333337,"24:00",1]
["ROC","KE0YBL","FIXED","PH",1400,2400,1,null,{"$f":"IF(A131=\"\",\"\",A131)","v":"ROC"},{"$f":"IF(B131=\"\",\"\",B131)","v":"KE0YBL"},{"$f":"IF(C131=\"\",\"\",C131)","v":"FIXED"},{"$f":"IF(D131=\"\",\"\",D131)","v":"PH"},{"$f":"IF(E131=\"TBD\",\"TBD\",IF(E131=\"part time\",\"part time\",IF(ISBLANK(E131),\"\",TIMEVALUE(LEFT(E131,LEN(E131)-2)&\":\"&RIGHT(E131,2)))))","v":0.58333333333333337},{"$f":"IF(F131=2400,\"24:00\",IF(ISBLANK(F131),\"\",TIMEVALUE(LEFT(F131,LEN(F131)-2)&\":\"&RIGHT(F131,2))))","v":"24:00"},{"$f":"IF(G131=\"\",\"\",G131)","v":1}]
["MOW","KF0GV","FIXED","PH/CW",1400,2400,1,null,"MOW","KF0GV","FIXED","PH/CW",0.58333333333333337,"24:00",1]
["WAB","KI0F","FIXED","PH/CW",1400,2400,1,null,"WAB","KI0F","FIXED","PH/CW",0.58333333333333337,"24:00",1]
["DAK","KN0V","FIXED","PH/CW",1400,2400,1,null,"DAK","KN0V","FIXED","PH/CW",0.58333333333333337,"24:00",1]
["DAK","N0BAK","FIXED","PH/CW",1400,2400,1,null,"DAK","N0BAK","FIXED","PH/CW",0.58333333333333337,"24:00",1]
["WIN","N0BUI","FIXED","CW",1400,2400,1,null,"WIN","N0BUI","FIXED","CW",0.58333333333333337,"24:00",1]
["RDW","N0ECK","ROVER","PH/CW",1400,2400,1,null,"RDW","N0ECK","ROVER","PH/CW",0.58333333333333337,"24:00",1]
["RDW","N0ECK","ROVER","PH/CW",1400,2400,1,null,"RDW","N0ECK","ROVER","PH/CW",0.58333333333333337,"24:00",1]
["STL","N0EO","FIXED","CW",1400,2400,1,null,"STL","N0EO","FIXED","CW",0.58333333333333337,"24:00",1]
["ANO","N0HDR","FIXED","PH",1400,2400,1,null,"ANO","N0HDR","FIXED","PH",0.58333333333333337,"24:00",1]
["LES","N0HJZ","FIXED","PH/CW",1400,2400,1,null,"LES","N0HJZ","FIXED","PH/CW",0.58333333333333337,"24:00",1]
["MIL","N0OK","FIXED","PH/CW/DIG",1400,2400,1,null,"MIL","N0OK","FIXED","PH/CW/DIG",0.58333333333333337,"24:00",1]
["CRL","N0RMJ","FIXED","PH/CW",1400,2400,1,null,"CRL","N0RMJ","FIXED","PH/CW",0.58333333333333337,"24:00",1]
["DOD","N0SPN","ROVER","PH/CW",1430,1530,1,null,"DOD","N0SPN","ROVER","PH/CW",0.60416666666666663,0.64583333333333337,1]
["GOO","N0SPN","ROVER","PH/CW",1600,1700,2,null,"GOO","N0SPN","ROVER","PH/CW",0.66666666666666663,0.70833333333333337,2]
["WAB","N0SPN","ROVER","PH/CW",1730,1830,3,null,"WAB","N0SPN","ROVER","PH/CW",0.72916666666666663,0.77083333333333337,3]
["OLM","N0SPN","ROVER","PH/CW",1900,2000,4,null,"OLM","N0SPN","ROVER","PH/CW",0.79166666666666663,0.83333333333333337,4]
["FIL","N0SPN","ROVER","PH/CW",2030,2130,5,null,"FIL","N0SPN","ROVER","PH/CW",0.85416666666666663,0.89583333333333337,5]
["MOW","N0SPN","ROVER","PH/CW",2230,2300,6,null,"MOW","N0SPN","ROVER","PH/CW",0.9375,0.95833333333333337,6]
["DOD","N0SPN","ROVER","PH/CW",2330,2400,7,null,"DOD","N0SPN","ROVER","PH/CW",0.97916666666666663,"24:00",7]
["STE","N0UR","FIXED","PH/CW",1400,2400,1,null,"STE","N0UR","FIXED","PH/CW",0.58333333333333337,"24:00",1]
["PEN","N0UY","FIXED","PH/CW",1400,2400,1,null,"PEN","N0UY","FIXED","PH/CW",0.58333333333333337,"24:00",1]
["FIL","N0V","FIXED","PH/CW",1400,2400,1,null,"FIL","N0V","FIXED","PH/CW",0.58333333333333337,"24:00",1]
["STL","N0VRM","FIXED","PH/CW",1400,2400,1,null,"STL","N0VRM","FIXED","PH/CW",0.58333333333333337,"24:00",1]
["HOU","N9CD","FIXED","PH/CW",1400,2400,1,null,"HOU","N9CD","FIXED","PH/CW",0.58333333333333337,"24:00",1]
["NOB","ND0C","FIXED","PH/CW",1400,2400,1,null,"NOB","ND0C","FIXED","PH/CW",0.58333333333333337,"24:00",1]
["COT","NG0E","FIXED","PH/CW",1400,2400,1,null,"COT","NG0E","FIXED","PH/CW",0.58333333333333337,"24:00",1]
["MEE","NY0A","FIXED","PH/CW",1400,2400,1,null,"MEE","NY0A","FIXED","PH/CW",0.58333333333333337,"24:00",1]
["DOD","W0BM","FIXED","PH/CW",1400,2400,1,null,"DOD","W0BM","FIXED","PH/CW",0.58333333333333337,"24:00",1]
["KIT","W0K","FIXED","PH/CW",1400,2400,1,null,"KIT","W0K","FIXED","PH/CW",0.58333333333333337,"24:00",1]
["HOU","W0M","FIXED","PH/CW",1400,2400,1,null,"HOU","W0M","FIXED","PH/CW",0.58333333333333337,"24:00",1]
["BEC","W0PI","FIXED","PH/CW",1400,2400,1,null,"BEC","W0PI","FIXED","PH/CW",0.58333333333333337,"24:00",1]
["PEN","W0RX","FIXED","PH/CW",1400,2400,1,null,"PEN","W0RX","FIXED","PH/CW",0.58333333333333337,"24:00",1]
["OLM","W0SHL","FIXED","PH/CW",1400,2400,1,null,"OLM","W0SHL","FIXED","PH/CW",0.58333333333333337,"24:00",1]
["STR","W0SV","FIXED","PH/CW",1400,2400,1,null,"STR","W0SV","FIXED","PH/CW",0.58333333333333337,"24:00",1]
["LES","W0WX","MOBILE","PH",1400,1425,1,null,"LES","W0WX","MOBILE","PH",0.58333333333333337,0.60069444444444442,1]
["NIC","W0WX","MOBILE","PH",1425,1450,2,null,"NIC","W0WX","MOBILE","PH",0.60069444444444442,0.61805555555555558,2]
["BLU","W0WX","MOBILE","PH",1450,1515,3,null,"BLU","W0WX","MOBILE","PH",0.61805555555555558,0.63541666666666663,3]
["WAT","W0WX","MOBILE","PH",1515,1540,4,null,"WAT","W0WX","MOBILE","PH",0.63541666666666663,0.65277777777777779,4]
["COT","W0WX","MOBILE","PH",1540,1605,5,null,"COT","W0WX","MOBILE","PH",0.65277777777777779,0.67013888888888884,5]
["LAC","W0WX","MOBILE","PH",1605,1630,6,null,"LAC","W0WX","MOBILE","PH",0.67013888888888884,0.6875,6]
["NOB","W0WX","MOBILE","PH",1630,1655,7,null,"NOB","W0WX","MOBILE","PH",0.6875,0.70486111111111116,7]
["MUR","W0WX","MOBILE","PH",1655,1720,8,null,"MUR","W0WX","MOBILE","PH",0.70486111111111116,0.72222222222222221,8]
["PIP","W0WX","MOBILE","PH",1720,1745,9,null,"PIP","W0WX","MOBILE","PH",0.72222222222222221,0.73958333333333337,9]
["LIN","W0WX","MOBILE","PH",1745,1810,10,null,"LIN","W0WX","MOBILE","PH",0.73958333333333337,0.75694444444444442,10]
["LYO","W0WX","MOBILE","PH",1810,1835,11,null,"LYO","W0WX","MOBILE","PH",0.75694444444444442,0.77430555555555558,11]
["RDW","W0WX","MOBILE","PH",1835,1900,12,null,"RDW","W0WX","MOBILE","PH",0.77430555555555558,0.79166666666666663,12]
["YEL","W0WX","MOBILE","PH",1900,1925,13,null,"YEL","W0WX","MOBILE","PH",0.79166666666666663,0.80902777777777779,13]
["REN","W0WX","MOBILE","PH",1925,1950,14,null,"REN","W0WX","MOBILE","PH",0.80902777777777779,0.82638888888888884,14]
["CHP","W0WX","MOBILE","PH",1950,2015,15,null,"CHP","W0WX","MOBILE","PH",0.82638888888888884,0.84375,15]
["KND","W0WX","MOBILE","PH",2015,2040,16,null,"KND","W0WX","MOBILE","PH",0.84375,0.86111111111111116,16]
["MEE","W0WX","MOBILE","PH",2040,2105,17,null,"MEE","W0WX","MOBILE","PH",0.86111111111111116,0.87847222222222221,17]
["MCL","W0WX","MOBILE","PH",2105,2130,18,null,"MCL","W0WX","MOBILE","PH",0.87847222222222221,0.89583333333333337,18]
["CRV","W0WX","MOBILE","PH",2130,2155,19,null,"CRV","W0WX","MOBILE","PH",0.89583333333333337,0.91319444444444442,19]
["SIB","W0WX","MOBILE","PH",2155,2220,20,null,"SIB","W0WX","MOBILE","PH",0.91319444444444442,0.93055555555555558,20]
["NIC","W0WX","MOBILE","PH",2220,2245,21,null,"NIC","W0WX","MOBILE","PH",0.93055555555555558,0.94791666666666663,21]
["LES","W0WX","MOBILE","PH",2245,2400,22,null,"LES","W0WX","MOBILE","PH",0.94791666666666663,"24:00",22]
["DAK","W0ZF","FIXED","PH/CW",1400,2400,1,null,"DAK","W0ZF","FIXED","PH/CW",0.58333333333333337,"24:00",1]
["CRV","W0ZQ","ROVER","PH/CW",1400,1630,1,null,"CRV","W0ZQ","ROVER","PH/CW",0.58333333333333337,0.6875,1]
["MCL","W0ZQ","ROVER","PH/CW",1400,1630,2,null,"MCL","W0ZQ","ROVER","PH/CW",0.58333333333333337,0.6875,2]
["WRI","W0ZQ","ROVER","PH/CW",1400,1630,3,null,"WRI","W0ZQ","ROVER","PH/CW",0.58333333333333337,0.6875,3]
["STR","W0ZQ","ROVER","PH/CW",1715,1745,4,null,"STR","W0ZQ","ROVER","PH/CW",0.71875,0.73958333333333337,4]
["SHE","W0ZQ","ROVER","PH/CW",1805,1835,5,null,"SHE","W0ZQ","ROVER","PH/CW",0.75347222222222221,0.77430555555555558,5]
["BEN","W0ZQ","ROVER","PH/CW",1855,1925,6,null,"BEN","W0ZQ","ROVER","PH/CW",0.78819444444444442,0.80902777777777779,6]
["MOR","W0ZQ","ROVER","PH/CW",1940,2010,7,null,{"$f":"IF(A195=\"\",\"\",A195)","v":"MOR"},{"$f":"IF(B195=\"\",\"\",B195)","v":"W0ZQ"},{"$f":"IF(C195=\"\",\"\",C195)","v":"ROVER"},{"$f":"IF(D195=\"\",\"\",D195)","v":"PH/CW"},{"$f":"IF(E195=\"TBD\",\"TBD\",IF(E195=\"part time\",\"part time\",IF(ISBLANK(E195),\"\",TIMEVALUE(LEFT(E195,LEN(E195)-2)&\":\"&RIGHT(E195,2)))))","v":0.81944444444444442},{"$f":"IF(F195=2400,\"24:00\",IF(ISBLANK(F195),\"\",TIMEVALUE(LEFT(F195,LEN(F195)-2)&\":\"&RIGHT(F195,2))))","v":0.84027777777777779},{"$f":"IF(G195=\"\",\"\",G195)","v":7}]
["CRO","W0ZQ","ROVER","PH/CW",2040,2115,8,null,"CRO","W0ZQ","ROVER","PH/CW",0.86111111111111116,0.88541666666666663,8]
["CAS","W0ZQ","ROVER","PH/CW",2140,2215,9,null,"CAS","W0ZQ","ROVER","PH/CW",0.90277777777777779,0.92708333333333337,9]
["TOD","W0ZQ","ROVER","PH/CW",2225,2315,10,null,"TOD","W0ZQ","ROVER","PH/CW",0.93402777777777779,0.96875,10]
["WAD","W0ZQ","ROVER","PH/CW",2327,2400,11,null,"WAD","W0ZQ","ROVER","PH/CW",0.9770833333333333,"24:00",11]
["ITA","W6GMT","FIXED","CW",1400,2400,1,null,"ITA","W6GMT","FIXED","CW",0.58333333333333337,"24:00",1]
["SWI","W9FZ","MOBILE","PH",1400,1445,1,null,"SWI","W9FZ","MOBILE","PH",0.58333333333333337,0.61458333333333337,1]
["BiG","W9FZ","MOBILE","PH",1530,1615,2,null,"BiG","W9FZ","MOBILE","PH",0.64583333333333337,0.67708333333333337,2]
["TRA","W9FZ","MOBILE","PH",1630,1715,3,null,"TRA","W9FZ","MOBILE","PH",0.6875,0.71875,3]
["STV","W9FZ","MOBILE","PH",1830,1915,4,null,"STV","W9FZ","MOBILE","PH",0.77083333333333337,0.80208333333333337,4]
["GRA","W9FZ","MOBILE","PH",1930,2015,5,null,"GRA","W9FZ","MOBILE","PH",0.8125,0.84375,5]
["POP","W9FZ","MOBILE","PH",2115,2200,6,null,"POP","W9FZ","MOBILE","PH",0.88541666666666663,0.91666666666666663,6]
["DOU","W9FZ","MOBILE","PH",2215,2300,7,null,"DOU","W9FZ","MOBILE","PH",0.92708333333333337,0.95833333333333337,7]
["TOD","W9FZ","MOBILE","PH",2315,2400,8,null,"TOD","W9FZ","MOBILE","PH",0.96875,"24:00",8]
["RAM","WA0LIF","FIXED","CW",1400,2400,1,null,"RAM","WA0LIF","FIXED","CW",0.58333333333333337,"24:00",1]
["ANO","WA0MHJ","FIXED","PH/CW",1830,2400,1,null,"ANO","WA0MHJ","FIXED","PH/CW",0.77083333333333337,"24:00",1]
["CHS","WQ0N","FIXED","PH/CW",1400,2400,1,null,"CHS","WQ0N","FIXED","PH/CW",0.58333333333333337,"24:00",1]
["CRO","WT0O","FIXED","PH/CW",1400,2400,1,null,"CRO","WT0O","FIXED","PH/CW",0.58333333333333337,"24:00",1]
[null,null,null,null,null,null,null,null,{"$f":"IF(A213=\"\",\"\",A213)","v":""},{"$f":"IF(B213=\"\",\"\",B213)","v":""},{"$f":"IF(C213=\"\",\"\",C213)","v":""},{"$f":"IF(D213=\"\",\"\",D213)","v":""},"",{"$f":"IF(F213=2400,\"24:00\",IF(ISBLANK(F213),\"\",TIMEVALUE(LEFT(F213,LEN(F213)-2)&\":\"&RIGHT(F213,2))))","v":""},{"$f":"IF(G213=\"\",\"\",G213)","v":""}]
[null,null,null,null,null,null,null,null,"","","","","","",""]
[null,null,null,null,null,null,null,null,"","","","","","",""]
[null,null,null,null,null,null,null,null,"","","","","","",""]
[null,null,null,null,null,null,null,null,"","","","","","",""]
[null,null,null,null,null,null,null,null,"","","","",{"$f":"IF(E218=\"TBD\",\"TBD\",IF(E218=\"part time\",\"part time\",IF(ISBLANK(E218),\"\",TIMEVALUE(LEFT(E218,LEN(E218)-2)&\":\"&RIGHT(E218,2)))))","v":""},"",""]
[null,null,null,null,null,null,null,null,"","","","","","",""]
[null,null,null,null,null,null,null,null,"","","","","","",""]
[null,null,null,null,null,null,null,null,"","","","","","",""]
[null,null,null,null,null,null,null,null,"","","","","","",""]
[null,null,null,null,null,null,null,null,"","","","","","",""]
[null,null,null,null,null,null,null,null,"","","","","","",""]
[null,null,null,null,null,null,null,null,"","","","","","",""]
[null,null,null,null,null,null,null,null,"","","","","","",""]
[null,null,null,null,null,null,null,null,"","","","","","",""]
[null,null,null,null,null,null,null,null,"","","","","","",""]
[null,null,null,null,null,null,null,null,"","","","","","",""]
[null,null,null,null,null,null,null,null,"","","","","","",""]
[null,null,null,null,null,null,null,null,"","","","","","",""]
[null,null,null,null,null,null,null,null,"","","","","","",""]
[null,null,null,null,null,null,null,null,"","","","","","",""]
[null,null,null,null,null,null,null,null,"","","","","","",""]
[null,null,null,null,null,null,null,null,"","","","","","",""]
[null,null,null,null,null,null,null,null,"","","","","","",""]
[null,null,null,null,null,null,null,null,"","","","","","",""]
[null,null,null,null,null,null,null,null,"","","","","","",""]
[null,null,null,null,null,null,null,null,"","","","","","",""]
[null,null,null,null,null,null,null,null,"","","","","","",""]
[null,null,null,null,null,null,null,null,"","","","","","",""]
[null,null,null,null,null,null,null,null,"","","","","","",""]
[null,null,null,null,null,null,null,null,"","","","","","",""]
[null,null,null,null,null,null,null,null,"","","","","","",""]
[null,null,null,null,null,null,null,null,"","","","","","",""]
[null,null,null,null,null,null,null,null,"","","","","","",""]
[null,null,null,null,null,null,null,null,"","","","","","",""]
[null,null,null,null,null,null,null,null,"","","","","","",""]
[null,null,null,null,null,null,null,null,"","","","","","",""]
[null,null,null,null,null,null,null,null,"","","","","","",""]
[null,null,null,null,null,null,null,null,"","","","","","",""]
[null,null,null,null,null,null,null,null,"","","","","","",""]
[null,null,null,null,null,null,null,null,"","","","","","",""]
[null,null,null,null,null,null,null,null,"","","","","","",""]
[null,null,null,null,null,null,null,null,"","","","","","",""]
[null,null,null,null,null,null,null,null,"","","","","","",""]
[null,null,null,null,null,null,null,null,"","","","","","",""]
[null,null,null,null,null,null,null,null,"",{"$f":"IF(B258=\"\",\"\",B258)","v":""},{"$f":"IF(C258=\"\",\"\",C258)","v":""},{"$f":"IF(D258=\"\",\"\",D258)","v":""},"",{"$f":"IF(F258=2400,\"24:00\",IF(ISBLANK(F258),\"\",TIMEVALUE(LEFT(F258,LEN(F258)-2)&\":\"&RIGHT(F258,2))))","v":""},{"$f":"IF(G258=\"\",\"\",G258)","v":""}]
[null,null,null,null,null,null,null,null,{"$f":"IF(A259=\"\",\"\",A259)","v":""},"","","","","",""]
[null,null,null,null,null,null,null,null,"","","","","","",""]
[null,null,null,null,null,null,null,null,"","","","","","",""]
[null,null,null,null,null,null,null,null,"","","","","","",""]
[null,null,null,null,null,null,null,null,"","","","","","",""]
[null,null,null,null,null,null,null,null,"","","","","","",""]
[null,null,null,null,null,null,null,null,"","","","","","",""]
[null,null,null,null,null,null,null,null,"","","","","","",""]
[null,null,null,null,null,null,null,null,"","","","","","",""]
[null,null,null,null,null,null,null,null,"","","","","","",""]
[null,null,null,null,null,null,null,null,"","","","","","",""]
[null,null,null,null,null,null,null,null,"","","","","","",""]
[null,null,null,null,null,null,null,null,"","","","","","",""]
[null,null,null,null,null,null,null,null,"","","","","","",""]
[null,null,null,null,null,null,null,null,"","","","","","",""]
[null,null,null,null,null,null,null,null,"","","","","","",""]
[null,null,null,null,null,null,null,null,"","","","","","",""]
[null,null,null,null,null,null,null,null,"","","","","","",""]
[null,null,null,null,null,null,null,null,"","","","","","",""]
[null,null,null,null,null,null,null,null,"","","","","","",""]
[null,null,null,null,null,null,null,null,"","","","","","",""]
[null,null,null,null,null,null,null,null,"","","","","","",""]
[null,null,null,null,null,null,null,null,"","","","","","",""]
[null,null,null,null,null,null,null,null,"","","","",{"$f":"IF(E282=\"TBD\",\"TBD\",IF(E282=\"part time\",\"part time\",IF(ISBLANK(E282),\"\",TIMEVALUE(LEFT(E282,LEN(E282)-2)&\":\"&RIGHT(E282,2)))))","v":""},"",""]
[null,null,null,null,null,null,null,null,"","","","","","",""]
[null,null,null,null,null,null,null,null,"","","","","","",""]
[null,null,null,null,null,null,null,null,"","","","","","",""]
[null,null,null,null,null,null,null,null,"","","","","","",""]
[null,null,null,null,null,null,null,null,"","","","","","",""]
[null,null,null,null,null,null,null,null,"","","","","","",""]
[null,null,null,null,null,null,null,null,"","","","","","",""]
[null,null,null,null,null,null,null,null,"","","","","","",""]
[null,null,null,null,null,null,null,null,"","","","","","",""]
[null,null,null,null,null,null,null,null,"","","","","","",""]
[null,null,null,null,null,null,null,null,"","","","","","",""]
[null,null,null,null,null,null,null,null,"","","","","","",""]
[null,null,null,null,null,null,null,null,"","","","","","",""]
[null,null,null,null,null,null,null,null,"","","","","","",""]
[null,null,null,null,null,null,null,null,"","","","","","",""]
[null,null,null,null,null,null,null,null,"","","","","","",""]
[null,null,null,null,null,null,null,null,"","","","","","",""]
[null,null,null,null,null,null,null,null,"","","","","","",""]
[null,null,null,null,null,null,null,null,"","","","","","",""]
[null,null,null,null,null,null,null,null,"CTY","CALL","MOBILE","MODES","START","FINISH","SEQ"]

{"sheet":"Revisions","index":3,"n_rows":13,"n_cols":4,"rows_kept":13,"cut":false,"hidden":false,"merged":[]}
[]
[]
[null,"Rev","Date","Changes"]
[]
[]
[null,24.01,"2024-03-10","Adjust K0RC route after review of plans by others"]
[null,24,"2024-03-09","Create new WiQP workbook and input mobile data"]
[]
[null,10,"2022-02-08","Create new WiQP workbook from MnQP workbook"]
[null,null,null,"Adjust counties from 87 in MN to 72 in WI"]
[]
[null,1,"2014-01-31","Create original WiQP workbook using MS Office Excel 2003"]
[null,null,null,"Author - Robert Chudek, K0RC"]